{"text_format":"1","workbook":"xlsx","n_sheets":13,"sheets":["INÍCIO","Modelo 3","Anexo A","Anexo B","Anexo E","Anexo F","Anexo G","Anexo H","Anexo J","Deduções à Coleta","Artigos","Simulação","Folha para Imprimir"],"not_rendered":{"charts":0,"images":0,"macros":1,"external_links":0,"defined_names":0,"comments":8,"pivot_tables":0},"unopened":[],"bounds":{"document_bytes":16777216,"sheet_cells":100000,"rows_first":2000,"rows_last":500,"rows_between":2000,"halvings":0,"cell_chars":16384,"cell_head_chars":4096},"cells_cut":0,"cells_raw":0,"read":"whole","date_system":"1900"}

{"sheet":"INÍCIO","index":0,"n_rows":59,"n_cols":14,"rows_kept":59,"cut":false,"hidden":false,"merged":[[44,1,45,2],[47,2,48,2],[40,1,40,15],[41,1,41,15],[1,1,1,15],[5,1,5,15],[7,1,7,15],[3,1,3,15],[6,12,6,14],[9,10,9,11],[9,12,9,15],[9,1,9,9]]}
[]
[null,"Simulador do IRS  "]
[]
[null,"Ano dos rendimentos 2018"]
[]
[null,"IRS a entregar em 2019"]
[]
[null,{"$f":"IF(HOUR(NOW())<5,\"Boa noite utilizador\",IF(HOUR(NOW())<12,\"Bom dia utilizador\",IF(HOUR(NOW())<19,\"Boa tarde utilizador\",IF(HOUR(NOW())>=19,\"Boa noite utilizador\"))))","v":"Boa noite utilizador"}]
[]
[null,{"$f":"'Modelo 3'!P105","v":""},null,null,null,null,null,null,null,null,{"$f":"TEXT(M10,\"dddd,\")","v":"domingo,"},null,{"$f":"TODAY()","v":"2019-05-26"}]
[]
[]
[]
[]
[]
[]
[null,"Para iniciar a simulação comece por",null,null,"➤",null,null,"-","Declaração Mod. 3 - Rosto"]
[]
[]
[null,"Se tem rendimentos destas categorias",null,null,{"$f":"'Anexo A'!B45","v":"➤"},null,null,"-","Anexo A - Trabalho dependente e pensões"]
[]
[]
[null,"Se tem rendimentos desta categoria ",null,null,{"$f":"'Anexo B'!B92","v":"➤"},null,null,"-","Anexo B - Rendimentos da categoria B - Regime Simplificado / Ato Isolado"]
[]
[]
[null,"Se tem rendimentos desta categoria ",null,null,{"$f":"'Anexo E'!B40","v":"➤"},null,null,"-","Anexo E - Rendimentos de capitais"]
[]
[]
[null,"Se tem rendimentos desta categoria ",null,null,{"$f":"'Anexo F'!B36","v":"➤"},null,null,"-","Anexo F - Rendimentos Prediais"]
[]
[]
[null,"Se vendeu algum imóvel ou ações ",null,null,{"$f":"'Anexo G'!B47","v":"➤"},null,null,"-","Anexo G - Mais-valias e outros incrementos patrimoniais"]
[]
[]
[null,"Se tem despesa no e-fatura/outras ",null,null,{"$f":"'Anexo H'!B76","v":"➤"},null,null,"-","Anexo H - Benefícios fiscais e deduções"]
[]
[]
[null,"Se tem rendimentos desta categoria",null,null,{"$f":"'Anexo J'!B21","v":"➤"},null,null,"-","Anexo J - Rendimentos obtidos no estrangeiro"]
[]
[]
[null,"Em 2019, o prazo de entrega da declaração do IRS é de 1 de abril a 30 de junho"]
[null,{"$f":"'Modelo 3'!P112","v":"Está a decorrer a entrega do IRS de 01 de abril a 30 de junho"}]
[]
[]
[null,"AVISO :",null,"Não esquecer de ativar as macros (Ativar Edição). O simulador só funciona com o Microsoft Office Excel."]
[null,null,null,"O simulador abrange somente as questões mais frequentes."]
[]
[null,null,"✉","Francisco Mesquita"]
[null,null,null,"fmkapelongo@gmail.com;",null,null,null,null,null,null,null,null,null,"Versão  10 . 2018"]
[]
[null,{"$f":"'Modelo 3'!P114","v":""}]
[]
[null,"PEDIDO:"]
[null,"Quando comunicarem algum bug, mandem-me por favor em anexo o simulador preenchido com os valores que deram o erro detetado para o e-mail  supracitado,"]
[null,"este e-mail destina-se apenas para o reporte de erros. "]
[]
[null,"NOTA:"]
[null,"Não presto quaisquer  informação sobre serviços de assistência fiscal, contabilidade, ou outros. Lembro que as simulações feitas neste simulador não dispensam a consulta "]
[null,"das publicações oficiais, Leis, normas regulamentares da AT."]

{"sheet":"Modelo 3","index":1,"n_rows":377,"n_cols":20,"rows_kept":377,"cut":false,"hidden":false,"merged":[[102,16,102,17],[103,15,103,17],[104,15,104,17],[112,15,112,17],[113,15,113,17],[106,15,106,17],[109,15,109,17],[110,15,110,17],[8,15,8,20],[9,15,9,22],[35,16,35,17],[80,15,80,17],[61,15,62,17],[100,16,100,17],[90,16,90,17],[91,16,91,17],[92,16,92,17],[94,16,94,17],[97,16,97,17],[98,16,98,17],[99,16,99,17],[93,16,93,17],[6,9,6,11],[4,8,4,11],[5,8,5,11],[3,8,3,11],[7,15,7,20],[8,9,8,11],[9,9,9,11],[11,9,11,13],[17,1,17,6],[35,10,35,11],[13,1,13,6],[11,3,11,4],[11,1,11,2],[10,3,10,5],[9,6,9,8],[45,7,45,8],[45,4,45,5],[45,1,45,2],[35,7,35,8],[39,1,40,2],[37,1,37,2],[37,4,37,5],[37,8,37,9],[5,1,5,3],[3,1,3,3],[5,5,5,6],[3,5,3,6],[4,1,4,3],[4,5,4,6],[372,5,372,6],[61,7,61,10],[82,16,82,17],[83,16,83,17],[84,16,84,17],[85,16,85,17],[86,16,86,17],[87,16,87,17],[88,16,88,17],[89,16,89,17],[61,3,61,6],[101,16,101,17],[95,16,95,17],[96,16,96,17],[111,15,111,17],[61,11,62,14]]}
[]
[]
[]
[null,"QUADROS 4 e 5A",null,null,null,"QUADRO 8A",null,null," QUADRO 8B - NÃO RESIDENTES"]
[null,"ESTADO CIVIL DOS SUJEITOS PASSIVOS  [Indique abaixo]  ",null,null,null,"RESIDÊNCIA FISCAL [Indique abaixo]  ",null,null,{"$f":"TEXT(B63,)","v":""}]
[null,"Casados, opção pela tributação separada",null,null,null,"Continente",null,null,{"$f":"TEXT(B62,)","v":""},null,null,null,"Sim","Não"]
[null,{"$f":"TEXT(B71,)","v":""},null,null,null,null,null,null,null,{"$f":"TEXT(B66,)","v":""}]
[null,{"$f":"TEXT(B72,)","v":""},null,null,null,null,null,null,null,{"$f":"TEXT(B65,)","v":""},null,null,"Sim","Não"]
[null,{"$f":"TEXT(B73,)","v":""},null,null,null,null,null,null,null,{"$f":"TEXT(B67,)","v":""}]
[null,"Sociedade Conjugal - Ocorreu o óbito de um dos cônjuges em 2018 ? ➤",null,null,null,"Não",{"$f":"TEXT(B69,)","v":""},null,null,{"$f":"TEXT(B68,)","v":""}]
[null,null,null,"CONCELHO DA ÁREA DO DOMICÍLIO FISCAL"]
[null,"Para apurar o Benefício Municipal ➤",null,"Indique aqui o Concelho",null,{"$f":"F373","v":0},null,null,null,{"$f":"TEXT(B70,)","v":""}]
[]
[null,"QUADROS 6B e 7A"]
[null,"DEPENDENTES, AFILHADOS CIVIS, ASCENDENTES E COLATERAIS ATÉ AO 3º GRAU",null,null,null,null,"Dependentes, com ✚\nde 3 anos de  idade","Dependentes, até 3 anos de idade","Afilhados civis, com ✚\n de 3 anos de idade","Afilhados civis, até 3 anos de idade","Ascendentes e colaterais até ao 3.º grau"]
[null,"N.º de Dependentes e afilhados civis até 25 anos de idade, e ascendentes "]
[null,"N.º de Dependentes e afilhados civis até 25 anos de idade, [Guarda conjunta, com residência alternada]"]
[null,"QUADROS 3, 5A, 6B e 7A"]
[null,"SUJEITOS PASSIVOS, DEPENDENTES, ASCENDENTES  E COLATERAIS ATÉ AO 3º GRAU, DEFICIENTES   ",null,null,null,null,null,"Sujeito Passivo A","Sujeito Passivo B","Dependentes e Afilhados civis","Dependentes em \nGuarda Conjunta"]
[null,"Indique o Nº de deficientes, cujo grau de invalidez seja ≥ 60% e < 90 %",null,null,null,null,"♿ →"]
[null,"Indique o Nº de deficientes, cujo grau de invalidez  seja igual ou superior a 90 %",null,null,null,null,"♿ →"]
[null,"Indique o Nº de deficientes das Forças Armadas, cujo grau de invalidez seja  ≥ 60%  e < 90%. ",null,null,null,null,"♿ →"]
[null,"Indique o Nº de deficientes das Forças Armadas, cujo grau de invalidez  seja igual ou superior a 90 %",null,null,null,null,"♿ →"]
[null,"Indique o Nº de  ascendentes e colaterais até ao 3º Grau portadores de deficiência igual ou superior a 60%, que vivam em comunhão de habitação com os sujeitos passivos             ♿ →"]
[]
[]
[]
[]
[]
[]
[]
[]
[]
[null,"INÍCIO"]
[]
[null,"RMMG 2010",475,"RMMG 2018",580,"IAS 2018",428.9,"Dedução específica →",null,4104,"Taxas T. Autónoma →",null,0.05,{"$f":"IF(F52=2,8%,10%)","v":0.1},0.2,{"$f":"IF(F52=2,22.4%,28%)","v":0.28000000000000003},"Taxas N/ residentes →",null,0.25,0.28000000000000003]
[]
[null,"Tributação Separada →",null,{"$f":"IF(C58=2,1,IF(C58=4,1,IF(C58=6,1,)))","v":1},"Família Monoparental →",null,{"$f":"IF(H38=0,0,IF(C59=2,0,IF(C59=1,1,0)))","v":0},{"$f":"SUM(G16+H16+I16+J16+G17+H17+I17+J17)","v":0},"Tributação Conjunta →",null,{"$f":"IF(C58=1,2,IF(C58=3,2,IF(C58=5,2,)))","v":0}]
[]
[null,"Não residentes ",null,false,false,false,false,false,false]
[null,null,null,{"$f":"IF(G41>=1,0,IF(D40=TRUE,1,))","v":0},{"$f":"IF(H41>=1,0,IF(D41>=1,0,IF(E40=TRUE,2,0)))","v":0},{"$f":"IF(F52=5,0,IF(I41>=1,0,IF(D41>=1,0,IF(F40=TRUE,4,))))","v":0},{"$f":"IF(G40=TRUE,4,)","v":0},{"$f":"IF(H40=TRUE,5,)","v":0},{"$f":"IF(I40=TRUE,6,)","v":0}]
[]
[null,null,null,{"$f":"IF(F52<=3,0,AND(F52=4,D41>=1,\"VERDADEIRO\"))","v":0},{"$f":"IF(F52=5,FALSE,IF(F52<=3,0,IF(F52=4,E41>=1,\"VERDADEIRO\")))","v":0},{"$f":"IF(F52=5,FALSE,IF(F52<=3,0,IF(F52=4,F41>=1,\"VERDADEIRO\")))","v":0},false,false,false]
[]
[]
[null,"Eatado civil ",null,null,"Residência Fiscal",null,null,"Óbito Cônjuge"]
[null,"Casados, opção pela tributação conjunta",1,null,"Continente",1,null,"Sim",1]
[null,"Casados, opção pela tributação separada",2,null,"Região Autónoma dos Açores",2,null,"Não",2]
[null,"Unidos de facto, opção pela tributação conjunta",3,null,"Região Autónoma da Madeira",3,null,null,{"$f":"VLOOKUP(F10,H47:I48,2,FALSE)","v":2}]
[null,"Unidos de facto, opção pela tributação separada",4,null,"País da Comunidade Europeia",4]
[null,"Viúvo(a), opção pela tributação conjunta ",5,null,"Outro País",5]
[null,"Viúvo(a), opção pela tributação  separada ",6,null,null,{"$f":"VLOOKUP(F6,E47:F51,2,FALSE)","v":1}]
[null,"Viúvo(a)",7]
[null,"Solteiro(a)",8]
[null,"Divorciado(a)",9]
[null,"Separado(a) judicialmente",10]
[null,"Separado(a) de facto",11]
[null,"Quociente conjugal",{"$f":"VLOOKUP(B6,B47:C57,2,FALSE)","v":2}]
[null,"F. Monoparental",{"$f":"IF(C58<=6,2,IF(C58>=7,1))","v":2}]
[]
[null,{"$f":"IF(F41=4,4,)","v":0},{"$f":"IF(F52=4,4,)","v":0},{"$f":"SUM(B61:C61)","v":0}]
[null,{"$f":"IF(F52=4,\"Se reside na União Europeia ou no Espaço Económico Europeu indique:\",)","v":0},null,"Taxa de Participação no IRS dos Municípios",null,null,null,"Desvalorização da Moeda",null,null,null,"Veja aqui a Tabela atividade do art.º 151.º do CIRS",null,null,null,"Rendimentos da cat. E"]
[null,{"$f":"IF(F52=5,\"Não residente Campo 04 \",IF(F52=4,\"Residência em país da UE ou EEE Campo 06 \",))","v":0},null,null,{"$f":"VLOOKUP(D12,D64:E372,2,FALSE)","v":1},null,null,null,{"$f":"VLOOKUP('Anexo G'!M7,H64:I113,2,FALSE)","v":1}]
[null,{"$f":"IF(F52=4,\"A simulação dos não residentes, pode conter alguns erros, para os corrigir, agradecia a quem já declarou em anos anteriores este tipo de rendimentos fizesse o obséquio de partilhar comigo os anexos enviados e demonstração de liquidação de IRS da AT\",)","v":0},null,"Indique aqui o Concelho",1,null,null,"Ano",1,null,null,"Veja aqui a Tabela atividade do art.º 151.º do CIRS",null,null,null,"ANEXO E - QUADRO 4A"]
[null,{"$f":"IF(F52=4,\"✓ 08 - Ou opta por um dos regimes abaixo indicados ?  ▼\",)","v":0},null,"Abrantes",2,5.0000000000000001E-3,{"$f":"IF(E63=E65,F65,)","v":0},1970,2,56.68,{"$f":"IF(I63=I65,J65,)","v":0},"1000 Agentes técnicos de engenharia e arquitetura",null,null,2,"Clique aqui para indicar o código dos rendimentos",null,1]
[null,{"$f":"IF(F52=4,\"✓ O7 - Pretende a tributação pelo regime geral ? ➤\",)","v":0},null,"Águeda",3,0.05,{"$f":"IF(E63=E66,F66,)","v":0},1971,3,53.95,{"$f":"IF(I63=I66,J66,)","v":0},"1001 Arquitetos",null,null,3,"E01 - Rendimentos do uso ou da concessão do uso de equipamento agrícola, industrial, comercial ou científico ou provenientes de contratos de cessão/utilização de direitos de propriedade intelectual, industrial ou de prestação de informações ou assistência técnica quando não auferidos pelo autor ou titular originário",null,2]
[null,{"$f":"IF(F52=4,\"✓ O9 - Opta pelas taxas gerais do art.º 68.º do CIRS - Relativamente aos rendimentos não sujeitos a retenção liberatória - art.º 72.º, n.º 9, do CIRS? ➤\",)","v":0},null,"Aguiar da Beira",4,0.05,{"$f":"IF(E63=E67,F67,)","v":0},1972,4,50.44,{"$f":"IF(I63=I67,J67,)","v":0},"1002 Desenhadores",null,null,4,"E10 - Rendimentos de lucros, reservas, adiantamentos por conta de lucros, de amortização de partes sociais e rendimentos auferidos na associação em participação e na associação à quota",null,3]
[null,{"$f":"IF(F52=4,\"✓ 10 - Opta pelas regras dos residentes - art.º 17.º-A do CIRS ? ➤\",)","v":0},null,"Alandroal",5,0,{"$f":"IF(E63=E68,F68,)","v":0},1973,5,45.85,{"$f":"IF(I63=I68,J68,)","v":0},"1003 Engenheiros",null,null,5,"E20 - Juros e outras formas de remuneração referidos no artigo 5º do CIRS, nomeadamente, juros de mútuos, depósitos, títulos de dívida pública, obrigações, suprimentos, adiantamentos de capital aos sócios ou por não levantamento de lucros, bem como o ganho de swaps de taxa de juros ou quaisquer rendimentos de aplicação de capitais",null,4]
[null,{"$f":"IF(D61=8,\"Se optar por esta regra, veja o que diz o art.º 17.º - A do CIRS  ➤\",)","v":0},null,"Albergaria-a-Velha",6,2.2499999999999999E-2,{"$f":"IF(E63=E69,F69,)","v":0},1974,6,35.17,{"$f":"IF(I63=I69,J69,)","v":0},"1004 Engenheiros técnicos",null,null,6,"E40 - Rendimentos dos baldios (nº4 do artigo 59º do EBF)",null,5]
[null,{"$f":"IF(F52>=4,\"São considerados não residentes aqueles que tenham estado em território português por um período inferior a 183 dias, no ano a que dizem respeito os rendimentos \",)","v":0},null,"Albufeira",7,0.05,{"$f":"IF(E63=E70,F70,)","v":0},1975,7,30.4,{"$f":"IF(I63=I70,J70,)","v":0},"1005 Geólogos",null,null,7]
[null,{"$f":"IF(I49=1,\"Quando ocorre o óbito de um dos cônjuges, o que sobrevive deve proceder à entrega da Declaração de IRS, incluindo os rendimentos obtidos pelo falecido,\",)","v":0},null,"Alcácer do Sal",8,0.01,{"$f":"IF(E63=E71,F71,)","v":0},1976,8,25.16,{"$f":"IF(I63=I71,J71,)","v":0},"1006 Topógrafos",null,null,8,"ANEXO E - QUADRO 4B"]
[null,{"$f":"IF(I49=1,\"em (ESTADO CIVIL DOS SUJEITOS PASSIVOS) deve selecionar viúvo(a), opção pela tributação conjunta ou pela tributação separada.\",)","v":0},null,"Alcanena",9,0,{"$f":"IF(E63=E72,F72,)","v":0},1977,9,19.2,{"$f":"IF(I63=I72,J72,)","v":0},"2010 Artistas de teatro, bailado, cinema, rádio e televisão",null,null,9,"Clique aqui par indicar o código dos rendimentos",null,1]
[null,{"$f":"IF(I49=1,\"NOTA: Se o cônjuge sobrevivo tiver rendimentos coloca estes em Sujeito Passivo A, se o falecido teve rendimentos coloca em Sujeito Passivo B.\",)","v":0},null,"Alcobaça",10,1.2500000000000001E-2,{"$f":"IF(E63=E73,F73,)","v":0},1978,10,15.11,{"$f":"IF(I63=I73,J73,)","v":0},"2011 Artistas de circo",null,null,10,"E01 - Rendimentos do uso ou da concessão do uso de equipamento agrícola, industrial, comercial ou científico ou provenientes de contratos de cessão/utilização de direitos de propriedade intelectual, industrial ou de prestação de informações ou assistência técnica quando não auferidos pelo autor ou titular originário",null,2]
[null,null,null,"Alcochete",11,0,{"$f":"IF(E63=E74,F74,)","v":0},1979,11,11.92,{"$f":"IF(I63=I74,J74,)","v":0},"2019 Cantores",null,null,11,"E10 - Rendimentos de lucros, reservas, adiantamentos por conta de lucros, de amortização de partes sociais e rendimentos auferidos na associação em participação e na associação à quota",null,3]
[null,null,null,"Alcoutim",12,0.05,{"$f":"IF(E63=E75,F75,)","v":0},1980,12,10.75,{"$f":"IF(I63=I75,J75,)","v":0},"2012 Escultores",null,null,12,"E20 - Juros e outras formas de remuneração referidos no artigo 5º do CIRS, nomeadamente, juros de mútuos, depósitos, títulos de dívida pública, obrigações, suprimentos, adiantamentos de capital aos sócios ou por não levantamento de lucros, bem como o ganho de swaps de taxa de juros ou quaisquer rendimentos de aplicação de capitais",null,4]
[null,null,null,"Alenquer",13,2E-3,{"$f":"IF(E63=E76,F76,)","v":0},1981,13,8.7899999999999991,{"$f":"IF(I63=I76,J76,)","v":0},"2013 Músicos",null,null,13,"E30 - Rendimentos de unidades de participação em Fundos (mobiliário ou imobiliário) ou participações sociais em sociedades de investimento (mobiliário ou imobiliário) a que seja aplicável o artigo 22º do EBF (redacção em vigor até 30/06/2015)",null,5]
[null,null,null,"Alfândega da Fé",14,0,{"$f":"IF(E63=E77,F77,)","v":0},1982,14,7.29,{"$f":"IF(I63=I77,J77,)","v":0},"2014 Pintores",null,null,14,"E31 - Rendimentos de unidades de participação em Fundos (mobiliário ou imobiliário) ou participações sociais em sociedades de investimento (mobiliário ou imobiliário) a que seja aplicável a subalínea i) da alínea a) do nº 1 do artigo 22º-A do EBF (redacção em vigor a partir de 01/07/2015)",null,6]
[null,null,null,"Alijó",15,0,{"$f":"IF(E63=E78,F78,)","v":0},1983,15,5.84,{"$f":"IF(I63=I78,J78,)","v":0},"2015 Outros artistas",null,null,15,"E32 - Rendimentos das unidades de participação em fundos de capital de risco (nº 2 do artigo 23º do EBF), de investimento imobiliário em recursos florestais (nº 2 do artigo 24º do EBF) e em FII de reabilitação urbana (nº 2 do artigo 71º do EBF)",null,7]
[null,null,null,"Aljezur",16,2.5000000000000001E-2,{"$f":"IF(E63=E79,F79,)","v":0},1984,16,4.53,{"$f":"IF(I63=I79,J79,)","v":0},"3010 Toureiros",null,null,16,"E40 - Rendimentos dos baldios (nº4 do artigo 59º do EBF)",null,8]
[null,null,null,"Aljustrel",17,0,{"$f":"IF(E63=E80,F80,)","v":0},1985,17,3.79,{"$f":"IF(I63=I80,J80,)","v":0},"3019 Outros artistas tauromáquicos",null,null,17]
[null,null,null,"Almada",18,0,{"$f":"IF(E63=E81,F81,)","v":0},1986,18,3.43,{"$f":"IF(I63=I81,J81,)","v":0},"4010 Atuários",null,null,18,2019]
[null,null,null,"Almeida",19,0.02,{"$f":"IF(E63=E82,F82,)","v":0},1987,19,3.14,{"$f":"IF(I63=I82,J82,)","v":0},"4011 Auditores",null,null,19,"Feriados",{"$f":"TODAY()","v":"2019-05-26"}]
[null,null,null,"Almeirim",20,0,{"$f":"IF(E63=E83,F83,)","v":0},1988,20,2.82,{"$f":"IF(I63=I83,J83,)","v":0},"4012 Consultores fiscais",null,null,20,"2019-01-01","Feriado Nacional,  Ano Novo"]
[null,null,null,"Almodôver",21,0,{"$f":"IF(E63=E84,F84,)","v":0},1989,21,2.54,{"$f":"IF(I63=I84,J84,)","v":0},"4013 Contabilistas",null,null,21,"2019-01-06","Dia de Reis"]
[null,null,null,"Alpiarça",22,0,{"$f":"IF(E63=E85,F85,)","v":0},1990,22,2.27,{"$f":"IF(I63=I85,J85,)","v":0},"4014 Economistas",null,null,22,"2019-02-14","Dia de S. Valentim (dia dos namorados)"]
[null,null,null,"Alter do Chão",23,2.5000000000000001E-2,{"$f":"IF(E63=E86,F86,)","v":0},1991,23,2.0099999999999998,{"$f":"IF(I63=I86,J86,)","v":0},"4015 Técnicos oficiais de contas",null,null,23,"2019-03-05","Dia de Carnaval"]
[null,null,null,"Alvaiázere",24,0,{"$f":"IF(E63=E87,F87,)","v":0},1992,24,1.85,{"$f":"IF(I63=I87,J87,)","v":0},"4016 Técnicos similares",null,null,24,"2019-03-08","Dia Internacional da Mulher"]
[null,null,null,"Alvito",25,0,{"$f":"IF(E63=E88,F88,)","v":0},1993,25,1.71,{"$f":"IF(I63=I88,J88,)","v":0},"5010 Enfermeiros",null,null,25,"2019-03-19","Dia do Pai"]
[null,null,null,"Amadora",26,1.2E-2,{"$f":"IF(E63=E89,F89,)","v":0},1994,26,1.63,{"$f":"IF(I63=I89,J89,)","v":0},"5012 Fisioterapeutas",null,null,26,"2019-04-19","Feriado Nacional, Sexta Feira Santa"]
[null,null,null,"Amarante",27,0,{"$f":"IF(E63=E90,F90,)","v":0},1995,27,1.57,{"$f":"IF(I63=I90,J90,)","v":0},"5013 Nutricionistas",null,null,27,"2019-04-21","Feriado Nacional, Páscoa"]
[null,null,null,"Amares",28,0,{"$f":"IF(E63=E91,F91,)","v":0},1996,28,1.53,{"$f":"IF(I63=I91,J91,)","v":0},"5014 Parteiras",null,null,28,"2019-04-25","Feriado Nacional, Dia da Liberdade "]
[null,null,null,"Anadia",29,0.01,{"$f":"IF(E63=E92,F92,)","v":0},1997,29,1.51,{"$f":"IF(I63=I92,J92,)","v":0},"5015 Terapeutas da fala",null,null,29,"2019-05-01","Feriado Nacional, Dia do Trabalhador"]
[null,null,null,"Angra do Heroísmo",30,0,{"$f":"IF(E63=E93,F93,)","v":0},1998,30,1.46,{"$f":"IF(I63=I93,J93,)","v":0},"5016 . Terapeutas ocupacionais",null,null,30,"2019-05-05","Dia da Mãe"]
[null,null,null,"Ansião",31,0,{"$f":"IF(E63=E94,F94,)","v":0},1999,31,1.44,{"$f":"IF(I63=I94,J94,)","v":0},"5019 Outros técnicos paramédicos",null,null,31,"2019-06-01","Dia Mundial da Criança"]
[null,null,null,"Arcos de Valdevez",32,0.01,{"$f":"IF(E63=E95,F95,)","v":0},2000,32,1.41,{"$f":"IF(I63=I95,J95,)","v":0},"6010 Advogados",null,null,32,"2019-06-10","Feriado Nacional, Dia de Portugal"]
[null,null,null,"Arganil",33,0.05,{"$f":"IF(E63=E96,F96,)","v":0},2001,33,1.32,{"$f":"IF(I63=I96,J96,)","v":0},"6011 Jurisconsultos",null,null,33,"2019-06-20","Feriado Nacional, Corpo de Deus"]
[null,null,null,"Armamar",34,0.05,{"$f":"IF(E63=E97,F97,)","v":0},2002,34,1.27,{"$f":"IF(I63=I97,J97,)","v":0},"6012 Solicitadores",null,null,34,"2019-08-15","Feriado Nacional, Assunção de Nossa Senhora"]
[null,null,null,"Arouca",35,0.05,{"$f":"IF(E63=E98,F98,)","v":0},2003,35,1.23,{"$f":"IF(I63=I98,J98,)","v":0},"7010 Dentistas",null,null,35,"2019-10-05","Feriado Nacional, Implantação da República"]
[null,null,null,"Arraiolos",36,0.05,{"$f":"IF(E63=E99,F99,)","v":0},2004,36,1.21,{"$f":"IF(I63=I99,J99,)","v":0},"7011 Médicos analistas",null,null,36,"2019-11-01","Feriado Nacional, Dia de Todos os Santos"]
[null,null,null,"Arronches",37,2.5000000000000001E-2,{"$f":"IF(E63=E100,F100,)","v":0},2005,37,1.19,{"$f":"IF(I63=I100,J100,)","v":0},"7012 Médicos cirurgiões",null,null,37,"2019-11-27","Feriado Munucipal da Guarda"]
[null,null,null,"Arruda dos Vinhos",38,0.01,{"$f":"IF(E63=E101,F101,)","v":0},2006,38,1.1499999999999999,{"$f":"IF(I63=I101,J101,)","v":0},"7013 Médicos de bordo em navios",null,null,38,"2019-12-01","Feriado Nacional, Restauração da Independência"]
[null,null,null,"Aveiro",39,0,{"$f":"IF(E63=E102,F102,)","v":0},2007,39,1.1299999999999999,{"$f":"IF(I63=I102,J102,)","v":0},"7014 Médicos de clínica geral",null,null,39,"2019-12-08","Feriado Nacional, Dia da Imaculada Conceição"]
[null,null,null,"Avis",40,0,{"$f":"IF(E63=E103,F103,)","v":0},2008,40,1.0900000000000001,{"$f":"IF(I63=I103,J103,)","v":0},"7015 Médicos dentistas",null,null,40,"2019-12-25","Feriado Nacional, Natal"]
[null,null,null,"Azambuja",41,0,{"$f":"IF(E63=E104,F104,)","v":0},2009,41,1.1100000000000001,{"$f":"IF(I63=I104,J104,)","v":0},"7016 Médicos estomatologistas",null,null,41,{"$f":"IF(Q82=P83,Q83,IF(Q82=P84,Q84,IF(Q82=P85,Q85,IF(Q82=P86,Q86,IF(Q82=P87,Q87,IF(Q82=P88,Q88,IF(Q82=P89,Q89,))))))&IF(Q82=P90,Q90,IF(Q82=P91,Q91,IF(Q82=P92,Q92,IF(Q82=P93,Q93,IF(Q82=P94,Q94,IF(Q82=P95,Q95,IF(Q82=P96,Q96,))))))&IF(Q82=P97,Q97,IF(Q82=P98,Q98,IF(Q82=P99,Q99,IF(Q82=P100,Q100,IF(Q82=P101,Q101,IF(Q82=P102,Q102,))))))&IF(Q82=P103,Q103,\"\")))","v":""}]
[null,null,null,"Baião",42,0,{"$f":"IF(E63=E105,F105,)","v":0},2010,42,1.0900000000000001,{"$f":"IF(I63=I105,J105,)","v":0},"7017 Médicos fisiatras",null,null,42,{"$f":"IF(P81=2019,P104,\"\")","v":""}]
[null,null,null,"Barcelos",43,0,{"$f":"IF(E63=E106,F106,)","v":0},2011,43,1.05,{"$f":"IF(I63=I106,J106,)","v":0},"7018 Médicos gastroenterologistas",null,null,43]
[null,null,null,"Barrancos",44,0,{"$f":"IF(E63=E107,F107,)","v":0},2012,44,1.02,{"$f":"IF(I63=I107,J107,)","v":0},"7019 Médicos oftalmologistas",null,null,44,"Entrega de IRS"]
[null,null,null,"Barreiro",45,0,{"$f":"IF(E63=E108,F108,)","v":0},2013,45,1.02,{"$f":"IF(I63=I108,J108,)","v":0},"7020 Médicos ortopedistas",null,null,45,null,{"$f":"YEAR(NOW())","v":2019}]
[null,null,null,"Batalha",46,0,{"$f":"IF(E63=E109,F109,)","v":0},2014,46,1.02,{"$f":"IF(I63=I109,J109,)","v":0},"7021 Médicos otorrinolaringologistas",null,null,46,null,{"$f":"MONTH(NOW())","v":5}]
[null,null,null,"Beja",47,0,{"$f":"IF(E63=E110,F110,)","v":0},2015,47,1.02,{"$f":"IF(I63=I110,J110,)","v":0},"7022 Médicos pediatras",null,null,47,{"$f":"IF(Q109=4,\"Está a decorrer a entrega do IRS de 01 de abril a 30 de junho\",IF(Q109=5,\"Está a decorrer a entrega do IRS de 01 de abril a 30 de junho\",IF(Q109=6,\"Está a decorrer a entrega do IRS de 01 de abril a 30 de junho\",)))","v":"Está a decorrer a entrega do IRS de 01 de abril a 30 de junho"}]
[null,null,null,"Belmonte",48,2.5000000000000001E-2,{"$f":"IF(E63=E111,F111,)","v":0},2016,48,1.01,{"$f":"IF(I63=I111,J111,)","v":0},"7023 Médicos radiologistas",null,null,48,{"$f":"IF(Q108=2019,P110,)","v":"Está a decorrer a entrega do IRS de 01 de abril a 30 de junho"}]
[null,null,null,"Benavente",49,0,{"$f":"IF(E63=E112,F112,)","v":0},2017,49,1,{"$f":"IF(I63=I112,J112,)","v":0},"7024 Médicos de outras especialidades",null,null,49,{"$f":"IF(P111=0,\"\",P111)","v":"Está a decorrer a entrega do IRS de 01 de abril a 30 de junho"}]
[null,null,null,"Bombarral",50,1.4999999999999999E-2,{"$f":"IF(E63=E113,F113,)","v":0},2018,50,1,{"$f":"IF(I63=I113,J113,)","v":0},"8010 Explicadores",null,null,50,{"$f":"IF(Q109=3,\"DE 15 a 31 de março pode reclamar do cálculo do montante da dedução das despesas gerais e familiares e da dedução pela exigência de fatura, colocado no e-fatura pela AT\",)","v":0}]
[null,null,null,"Borba",51,5.0000000000000001E-3,{"$f":"IF(E63=E114,F114,)","v":0},null,null,null,null,"8011 Formadores",null,null,51,{"$f":"IF(P113=0,\"\",P113)","v":""}]
[null,null,null,"Boticas",52,0.05,{"$f":"IF(E63=E115,F115,)","v":0},null,null,null,null,"8012 Professores",null,null,52]
[null,null,null,"Braga",53,7.4999999999999997E-3,{"$f":"IF(E63=E116,F116,)","v":0},null,null,null,null,"9010 Revisores oficiais de contas",null,null,53]
[null,null,null,"Bragança",54,0,{"$f":"IF(E63=E117,F117,)","v":0},null,null,null,null,"*9011 Notários",null,null,54]
[null,null,null,"Cabeceiras de Basto",55,0.01,{"$f":"IF(E63=E118,F118,)","v":0},null,{"$f":"IF(K118=\"Tabela\",0,K118)","v":"0"},null,{"$f":"IF(I63=1,\"0\",MAX(K119:K121))","v":"0"},"1010 Psicólogos",null,null,55]
[null,null,null,"Cadaval",56,0.01,{"$f":"IF(E63=E119,F119,)","v":0},null,null,null,{"$f":"IF(I120=1,0,IF(I63=1,\"0\",SUM(K65:K113)))","v":"0"},"1011 Sociólogos",null,null,56]
[null,null,null,"Caldas da Rainha",57,0.02,{"$f":"IF(E63=E120,F120,)","v":0},null,{"$f":"IF('Anexo G'!C45=2,1,IF('Anexo G'!C45=3,1,))","v":0},null,{"$f":"IF(I120=1,SUM(K84:K113,))","v":false},"1110 Analistas",null,null,57]
[null,null,null,"Calheta (Açores)",58,0,{"$f":"IF(E63=E121,F121,)","v":0},null,null,null,{"$f":"SUM(K120)","v":0},"1210 Sacerdotes de qualquer religião",null,null,58]
[null,null,null,"Calheta (Madeira)",59,0.02,{"$f":"IF(E63=E122,F122,)","v":0},null,"Até 1-1-89, Isento",null,null,"1310 Administradores de bens",null,null,59]
[null,null,null,"Câmara de Lobos",60,0.02,{"$f":"IF(E63=E123,F123,)","v":0},null,null,null,null,"1311 Ajudantes familiares",null,null,60]
[null,null,null,"Caminha",61,3.5000000000000003E-2,{"$f":"IF(E63=E124,F124,)","v":0},null,null,null,null,"1312 Amas",null,null,61]
[null,null,null,"Campo Maior",62,0,{"$f":"IF(E63=E125,F125,)","v":0},null,null,null,null,"1313 Analistas de sistemas",null,null,62]
[null,null,null,"Cantanhede",63,0,{"$f":"IF(E63=E126,F126,)","v":0},null,null,null,null,"1314 Arqueólogos",null,null,63]
[null,null,null,"Carrazeda de Ansiães",64,0.05,{"$f":"IF(E63=E127,F127,)","v":0},null,null,null,null,"1315 Assistentes sociais",null,null,64]
[null,null,null,"Carregal do Sal",65,0,{"$f":"IF(E63=E128,F128,)","v":0},null,null,null,null,"1316 Astrólogos",null,null,65]
[null,null,null,"Cartaxo",66,0,{"$f":"IF(E63=E129,F129,)","v":0},null,null,null,null,"1317 Parapsicólogos",null,null,66]
[null,null,null,"Cascais",67,0,{"$f":"IF(E63=E130,F130,)","v":0},null,null,null,null,"1318 Biólogos",null,null,67]
[null,null,null,"Castanheira de Pêra",68,2.5000000000000001E-2,{"$f":"IF(E63=E131,F131,)","v":0},null,null,null,null,"1319 Comissionistas",null,null,68]
[null,null,null,"Castelo Branco",69,0,{"$f":"IF(E63=E132,F132,)","v":0},null,null,null,null,"1320 Consultores",null,null,69]
[null,null,null,"Castelo de Paiva",70,0.01,{"$f":"IF(E63=E133,F133,)","v":0},null,null,null,null,"1321 Dactilógrafos",null,null,70]
[null,null,null,"Castelo de Vide",71,1.4999999999999999E-2,{"$f":"IF(E63=E134,F134,)","v":0},null,null,null,null,"1322 Decoradores",null,null,71]
[null,null,null,"Castro Daire",72,0.01,{"$f":"IF(E63=E135,F135,)","v":0},null,null,null,null,"1323 Desportistas",null,null,72]
[null,null,null,"Castro Marim",73,0.05,{"$f":"IF(E63=E136,F136,)","v":0},null,null,null,null,"1324 Engomadores",null,null,73]
[null,null,null,"Castro Verde",74,0,{"$f":"IF(E63=E137,F137,)","v":0},null,null,null,null,"1325 Esteticistas, manicuras e pedicuras",null,null,74]
[null,null,null,"Celorico da Beira",75,0.01,{"$f":"IF(E63=E138,F138,)","v":0},null,null,null,null,"1326 Guias-intérpretes",null,null,75]
[null,null,null,"Celorico de Basto",76,0,{"$f":"IF(E63=E139,F139,)","v":0},null,null,null,null,"1327 Jornalistas e repórteres",null,null,76]
[null,null,null,"Chamusca",77,0,{"$f":"IF(E63=E140,F140,)","v":0},null,null,null,null,"1328 Louvados",null,null,77]
[null,null,null,"Chaves",78,0,{"$f":"IF(E63=E141,F141,)","v":0},null,null,null,null,"1329 Massagistas",null,null,78]
[null,null,null,"Cinfães",79,0.02,{"$f":"IF(E63=E142,F142,)","v":0},null,null,null,null,"1330 Mediadores imobiliários",null,null,79]
[null,null,null,"Coimbra",80,5.0000000000000001E-3,{"$f":"IF(E63=E143,F143,)","v":0},null,null,null,null,"1331 Peritos-avaliadores",null,null,80]
[null,null,null,"Condeixa-a-Nova",81,0,{"$f":"IF(E63=E144,F144,)","v":0},null,null,null,null,"1332 Programadores informáticos",null,null,81]
[null,null,null,"Constância",82,0,{"$f":"IF(E63=E145,F145,)","v":0},null,null,null,null,"1333 Publicitários",null,null,82]
[null,null,null,"Coruche",83,0.02,{"$f":"IF(E63=E146,F146,)","v":0},null,null,null,null,"1334 Tradutores.",null,null,83]
[null,null,null,"Corvo",84,0,{"$f":"IF(E63=E147,F147,)","v":0},null,null,null,null,"1335 Farmacêuticos",null,null,84]
[null,null,null,"Covilhã",85,0,{"$f":"IF(E63=E148,F148,)","v":0},null,null,null,null,"1336 Designers (aditada pela Lei n.º53-A/2006-29/12) ",null,null,85]
[null,null,null,"Crato",86,0,{"$f":"IF(E63=E149,F149,)","v":0},null,null,null,null,"1410 Veterinários"]
[null,null,null,"Cuba",87,0,{"$f":"IF(E63=E150,F150,)","v":0}]
[null,null,null,"Elvas",88,0,{"$f":"IF(E63=E151,F151,)","v":0}]
[null,null,null,"Entroncamento",89,0,{"$f":"IF(E63=E152,F152,)","v":0}]
[null,null,null,"Espinho",90,2.5000000000000001E-3,{"$f":"IF(E63=E153,F153,)","v":0}]
[null,null,null,"Esposende",91,0,{"$f":"IF(E63=E154,F154,)","v":0}]
[null,null,null,"Estarreja",92,0.02,{"$f":"IF(E63=E155,F155,)","v":0}]
[null,null,null,"Estremoz",93,0,{"$f":"IF(E63=E156,F156,)","v":0}]
[null,null,null,"Évora",94,0,{"$f":"IF(E63=E157,F157,)","v":0}]
[null,null,null,"Fafe",95,0.02,{"$f":"IF(E63=E158,F158,)","v":0}]
[null,null,null,"Faro",96,0,{"$f":"IF(E63=E159,F159,)","v":0}]
[null,null,null,"Felgueiras",97,0,{"$f":"IF(E63=E160,F160,)","v":0}]
[null,null,null,"Ferreira do Alentejo",98,0,{"$f":"IF(E63=E161,F161,)","v":0}]
[null,null,null,"Ferreira do Zêzere",99,2.5000000000000001E-2,{"$f":"IF(E63=E162,F162,)","v":0}]
[null,null,null,"Figueira da Foz",100,0.01,{"$f":"IF(E63=E163,F163,)","v":0}]
[null,null,null,"Figueira de Castelo Rodrigo",101,0.05,{"$f":"IF(E63=E164,F164,)","v":0}]
[null,null,null,"Figueiró dos Vinhos",102,0.01,{"$f":"IF(E63=E165,F165,)","v":0}]
[null,null,null,"Fornos de Algodres",103,0,{"$f":"IF(E63=E166,F166,)","v":0}]
[null,null,null,"Freixo de Espada à Cinta",104,0,{"$f":"IF(E63=E167,F167,)","v":0}]
[null,null,null,"Fronteira",105,0.03,{"$f":"IF(E63=E168,F168,)","v":0}]
[null,null,null,"Funchal",106,1.4999999999999999E-2,{"$f":"IF(E63=E169,F169,)","v":0}]
[null,null,null,"Fundão",107,0,{"$f":"IF(E63=E170,F170,)","v":0}]
[null,null,null,"Gavião",108,0.05,{"$f":"IF(E63=E171,F171,)","v":0}]
[null,null,null,"Góis",109,2.5000000000000001E-2,{"$f":"IF(E63=E172,F172,)","v":0}]
[null,null,null,"Golegã",110,0,{"$f":"IF(E63=E173,F173,)","v":0}]
[null,null,null,"Gondomar",111,5.0000000000000001E-3,{"$f":"IF(E63=E174,F174,)","v":0}]
[null,null,null,"Gouveia",112,0.02,{"$f":"IF(E63=E175,F175,)","v":0}]
[null,null,null,"Grândola",113,0,{"$f":"IF(E63=E176,F176,)","v":0}]
[null,null,null,"Guarda",114,0,{"$f":"IF(E63=E177,F177,)","v":0}]
[null,null,null,"Guimarães",115,0,{"$f":"IF(E63=E178,F178,)","v":0}]
[null,null,null,"Horta",116,2.5000000000000001E-3,{"$f":"IF(E63=E179,F179,)","v":0}]
[null,null,null,"Idanha-a-Nova",117,2.5000000000000001E-2,{"$f":"IF(E63=E180,F180,)","v":0}]
[null,null,null,"Ílhavo",118,0,{"$f":"IF(E63=E181,F181,)","v":0}]
[null,null,null,"Lagoa (Faro)",119,0.02,{"$f":"IF(E63=E182,F182,)","v":0}]
[null,null,null,"Lagoa (Açores)",120,0,{"$f":"IF(E63=E183,F183,)","v":0}]
[null,null,null,"Lagos",121,5.0000000000000001E-3,{"$f":"IF(E63=E184,F184,)","v":0}]
[null,null,null,"Lajes das Flores",122,0.01,{"$f":"IF(E63=E185,F185,)","v":0}]
[null,null,null,"Lajes do Pico",123,0,{"$f":"IF(E63=E186,F186,)","v":0}]
[null,null,null,"Lamego",124,0.01,{"$f":"IF(E63=E187,F187,)","v":0}]
[null,null,null,"Leiria",125,0,{"$f":"IF(E63=E188,F188,)","v":0}]
[null,null,null,"Lisboa",126,2.5000000000000001E-2,{"$f":"IF(E63=E189,F189,)","v":0}]
[null,null,null,"Loulé",127,0.05,{"$f":"IF(E63=E190,F190,)","v":0}]
[null,null,null,"Loures",128,0,{"$f":"IF(E63=E191,F191,)","v":0}]
[null,null,null,"Lourinhã",129,1.2500000000000001E-2,{"$f":"IF(E63=E192,F192,)","v":0}]
[null,null,null,"Lousã",130,0.01,{"$f":"IF(E63=E193,F193,)","v":0}]
[null,null,null,"Lousada",131,0.01,{"$f":"IF(E63=E194,F194,)","v":0}]
[null,null,null,"Mação",132,0.01,{"$f":"IF(E63=E195,F195,)","v":0}]
[null,null,null,"Macedo de Cavaleiros",133,0.04,{"$f":"IF(E63=E196,F196,)","v":0}]
[null,null,null,"Machico",134,0.01,{"$f":"IF(E63=E197,F197,)","v":0}]
[null,null,null,"Madalena",135,0,{"$f":"IF(E63=E198,F198,)","v":0}]
[null,null,null,"Mafra",136,2.5000000000000001E-3,{"$f":"IF(E63=E199,F199,)","v":0}]
[null,null,null,"Maia",137,0,{"$f":"IF(E63=E200,F200,)","v":0}]
[null,null,null,"Mangualde",138,0.01,{"$f":"IF(E63=E201,F201,)","v":0}]
[null,null,null,"Manteigas",139,0.05,{"$f":"IF(E63=E202,F202,)","v":0}]
[null,null,null,"Marco de Canaveses",140,0.01,{"$f":"IF(E63=E203,F203,)","v":0}]
[null,null,null,"Marinha Grande",141,0,{"$f":"IF(E63=E204,F204,)","v":0}]
[null,null,null,"Marvão",142,2.5000000000000001E-2,{"$f":"IF(E63=E205,F205,)","v":0}]
[null,null,null,"Matosinhos",143,0,{"$f":"IF(E63=E206,F206,)","v":0}]
[null,null,null,"Mealhada",144,0.03,{"$f":"IF(E63=E207,F207,)","v":0}]
[null,null,null,"Mêda",145,0,{"$f":"IF(E63=E208,F208,)","v":0}]
[null,null,null,"Melgaço",146,0,{"$f":"IF(E63=E209,F209,)","v":0}]
[null,null,null,"Mértola",147,0,{"$f":"IF(E63=E210,F210,)","v":0}]
[null,null,null,"Mesão Frio",148,0,{"$f":"IF(E63=E211,F211,)","v":0}]
[null,null,null,"Mira",149,0,{"$f":"IF(E63=E212,F212,)","v":0}]
[null,null,null,"Miranda do Corvo",150,0,{"$f":"IF(E63=E213,F213,)","v":0}]
[null,null,null,"Miranda do Douro",151,0,{"$f":"IF(E63=E214,F214,)","v":0}]
[null,null,null,"Mirandela",152,0.01,{"$f":"IF(E63=E215,F215,)","v":0}]
[null,null,null,"Mogadouro",153,2.5000000000000001E-2,{"$f":"IF(E63=E216,F216,)","v":0}]
[null,null,null,"Moimenta da Beira",154,0,{"$f":"IF(E63=E217,F217,)","v":0}]
[null,null,null,"Moita",155,0,{"$f":"IF(E63=E218,F218,)","v":0}]
[null,null,null,"Monção",156,0.02,{"$f":"IF(E63=E219,F219,)","v":0}]
[null,null,null,"Monchique",157,2.5000000000000001E-2,{"$f":"IF(E63=E220,F220,)","v":0}]
[null,null,null,"Mondim de Basto",158,0,{"$f":"IF(E63=E221,F221,)","v":0}]
[null,null,null,"Monforte",159,0,{"$f":"IF(E63=E222,F222,)","v":0}]
[null,null,null,"Montalegre",160,0,{"$f":"IF(E63=E223,F223,)","v":0}]
[null,null,null,"Montemor-o-Novo",161,0,{"$f":"IF(E63=E224,F224,)","v":0}]
[null,null,null,"Montemor-o-Velho",162,0,{"$f":"IF(E63=E225,F225,)","v":0}]
[null,null,null,"Montijo",163,0.01,{"$f":"IF(E63=E226,F226,)","v":0}]
[null,null,null,"Mora",164,0,{"$f":"IF(E63=E227,F227,)","v":0}]
[null,null,null,"Mortágua",165,0.05,{"$f":"IF(E63=E228,F228,)","v":0}]
[null,null,null,"Moura",166,0.02,{"$f":"IF(E63=E229,F229,)","v":0}]
[null,null,null,"Mourão",167,0,{"$f":"IF(E63=E230,F230,)","v":0}]
[null,null,null,"Murça",168,0,{"$f":"IF(E63=E231,F231,)","v":0}]
[null,null,null,"Murtosa",169,0.01,{"$f":"IF(E63=E232,F232,)","v":0}]
[null,null,null,"Nazaré",170,0,{"$f":"IF(E63=E233,F233,)","v":0}]
[null,null,null,"Nelas",171,0,{"$f":"IF(E63=E234,F234,)","v":0}]
[null,null,null,"Nisa",172,2.5000000000000001E-2,{"$f":"IF(E63=E235,F235,)","v":0}]
[null,null,null,"Nordeste",173,0,{"$f":"IF(E63=E236,F236,)","v":0}]
[null,null,null,"Óbidos",174,0.04,{"$f":"IF(E63=E237,F237,)","v":0}]
[null,null,null,"Odemira",175,5.0000000000000001E-3,{"$f":"IF(E63=E238,F238,)","v":0}]
[null,null,null,"Odivelas ",176,0,{"$f":"IF(E63=E239,F239,)","v":0}]
[null,null,null,"Oeiras",177,2E-3,{"$f":"IF(E63=E240,F240,)","v":0}]
[null,null,null,"Oleiros",178,0.05,{"$f":"IF(E63=E241,F241,)","v":0}]
[null,null,null,"Olhão",179,0,{"$f":"IF(E63=E242,F242,)","v":0}]
[null,null,null,"Oliveira de Azeméis",180,0,{"$f":"IF(E63=E243,F243,)","v":0}]
[null,null,null,"Oliveira de Frades",181,0,{"$f":"IF(E63=E244,F244,)","v":0}]
[null,null,null,"Oliveira do Bairro",182,5.0000000000000001E-3,{"$f":"IF(E63=E245,F245,)","v":0}]
[null,null,null,"Oliveira do Hospital",183,0,{"$f":"IF(E63=E246,F246,)","v":0}]
[null,null,null," Ourém ",184,0,{"$f":"IF(E63=E247,F247,)","v":0}]
[null,null,null,"Ourique",185,0,{"$f":"IF(E63=E248,F248,)","v":0}]
[null,null,null,"Ovar",186,0.02,{"$f":"IF(E63=E249,F249,)","v":0}]
[null,null,null,"Paços de Ferreira",187,0,{"$f":"IF(E63=E250,F250,)","v":0}]
[null,null,null,"Palmela",188,0,{"$f":"IF(E63=E251,F251,)","v":0}]
[null,null,null,"Pampilhosa da Serra",189,0,{"$f":"IF(E63=E252,F252,)","v":0}]
[null,null,null,"Paredes",190,0.01,{"$f":"IF(E63=E253,F253,)","v":0}]
[null,null,null,"Paredes de Coura",191,0.02,{"$f":"IF(E63=E254,F254,)","v":0}]
[null,null,null,"Pedrógão Grande",192,0,{"$f":"IF(E63=E255,F255,)","v":0}]
[null,null,null,"Penacova",193,0,{"$f":"IF(E63=E256,F256,)","v":0}]
[null,null,null,"Penafiel",194,0,{"$f":"IF(E63=E257,F257,)","v":0}]
[null,null,null,"Penalva do Castelo",195,0.01,{"$f":"IF(E63=E258,F258,)","v":0}]
[null,null,null,"Penamacor",196,0.01,{"$f":"IF(E63=E259,F259,)","v":0}]
[null,null,null,"Penedono",197,0.04,{"$f":"IF(E63=E260,F260,)","v":0}]
[null,null,null,"Penela",198,0,{"$f":"IF(E63=E261,F261,)","v":0}]
[null,null,null,"Peniche",199,0,{"$f":"IF(E63=E262,F262,)","v":0}]
[null,null,null,"Peso da Régua",200,0,{"$f":"IF(E63=E263,F263,)","v":0}]
[null,null,null,"Pinhel",201,0,{"$f":"IF(E63=E264,F264,)","v":0}]
[null,null,null,"Pombal",202,0,{"$f":"IF(E63=E265,F265,)","v":0}]
[null,null,null,"Ponta Delgada",203,0,{"$f":"IF(E63=E266,F266,)","v":0}]
[null,null,null,"Ponta do Sol",204,2.5000000000000001E-2,{"$f":"IF(E63=E267,F267,)","v":0}]
[null,null,null,"Ponte da Barca",205,0.05,{"$f":"IF(E63=E268,F268,)","v":0}]
[null,null,null,"Ponte de Lima",206,0.05,{"$f":"IF(E63=E269,F269,)","v":0}]
[null,null,null,"Ponte de Sor",207,0,{"$f":"IF(E63=E270,F270,)","v":0}]
[null,null,null,"Portalegre",208,0,{"$f":"IF(E63=E271,F271,)","v":0}]
[null,null,null,"Portel",209,0,{"$f":"IF(E63=E272,F272,)","v":0}]
[null,null,null,"Portimão",210,0,{"$f":"IF(E63=E273,F273,)","v":0}]
[null,null,null,"Porto",211,0,{"$f":"IF(E63=E274,F274,)","v":0}]
[null,null,null,"Porto de Mós",212,2.5000000000000001E-3,{"$f":"IF(E63=E275,F275,)","v":0}]
[null,null,null,"Porto Moniz",213,0.05,{"$f":"IF(E63=E276,F276,)","v":0}]
[null,null,null,"Porto Santo",214,0.01,{"$f":"IF(E63=E277,F277,)","v":0}]
[null,null,null,"Póvoa de Lanhoso",215,0,{"$f":"IF(E63=E278,F278,)","v":0}]
[null,null,null,"Póvoa de Varzim",216,0.01,{"$f":"IF(E63=E279,F279,)","v":0}]
[null,null,null,"Povoação",217,0,{"$f":"IF(E63=E280,F280,)","v":0}]
[null,null,null," Praia da Vitória      ",218,0,{"$f":"IF(E63=E281,F281,)","v":0}]
[null,null,null,"Proença-a-Nova",219,0,{"$f":"IF(E63=E282,F282,)","v":0}]
[null,null,null,"Redondo",220,0.02,{"$f":"IF(E63=E283,F283,)","v":0}]
[null,null,null,"Reguengos de Monsaraz",221,0,{"$f":"IF(E63=E284,F284,)","v":0}]
[null,null,null,"Resende",222,0.05,{"$f":"IF(E63=E285,F285,)","v":0}]
[null,null,null,"Ribeira Brava",223,0,{"$f":"IF(E63=E286,F286,)","v":0}]
[null,null,null,"Ribeira de Pena",224,0.05,{"$f":"IF(E63=E287,F287,)","v":0}]
[null,null,null,"Ribeira Grande",225,0.01,{"$f":"IF(E63=E288,F288,)","v":0}]
[null,null,null,"Rio Maior",226,2E-3,{"$f":"IF(E63=E289,F289,)","v":0}]
[null,null,null,"Sabrosa",227,0.05,{"$f":"IF(E63=E290,F290,)","v":0}]
[null,null,null,"Sabugal",228,0.05,{"$f":"IF(E63=E291,F291,)","v":0}]
[null,null,null,"Salvaterra de Magos",229,0,{"$f":"IF(E63=E292,F292,)","v":0}]
[null,null,null,"Santa Comba Dão",230,0,{"$f":"IF(E63=E293,F293,)","v":0}]
[null,null,null,"Santa Cruz",231,0.01,{"$f":"IF(E63=E294,F294,)","v":0}]
[null,null,null,"Santa Cruz da Graciosa",232,0.02,{"$f":"IF(E63=E295,F295,)","v":0}]
[null,null,null,"Santa Cruz das Flores",233,0.01,{"$f":"IF(E63=E296,F296,)","v":0}]
[null,null,null,"Santa Maria da Feira",234,0,{"$f":"IF(E63=E297,F297,)","v":0}]
[null,null,null,"Santa Marta de Penaguião",235,4.4999999999999998E-2,{"$f":"IF(E63=E298,F298,)","v":0}]
[null,null,null,"Santana",236,0.05,{"$f":"IF(E63=E299,F299,)","v":0}]
[null,null,null,"Santarém",237,0,{"$f":"IF(E63=E300,F300,)","v":0}]
[null,null,null,"Santiago do Cacém",238,0,{"$f":"IF(E63=E301,F301,)","v":0}]
[null,null,null,"Santo Tirso",239,2.5000000000000001E-3,{"$f":"IF(E63=E302,F302,)","v":0}]
[null,null,null,"São Brás de Alportel",240,0,{"$f":"IF(E63=E303,F303,)","v":0}]
[null,null,null,"São João da Madeira",241,5.0000000000000001E-3,{"$f":"IF(E63=E304,F304,)","v":0}]
[null,null,null,"São João da Pesqueira",242,0,{"$f":"IF(E63=E305,F305,)","v":0}]
[null,null,null,"São Pedro do Sul",243,0.01,{"$f":"IF(E63=E306,F306,)","v":0}]
[null,null,null,"São Roque do Pico",244,0,{"$f":"IF(E63=E307,F307,)","v":0}]
[null,null,null,"São Vicente",245,0,{"$f":"IF(E63=E308,F308,)","v":0}]
[null,null,null,"Sardoal",246,0,{"$f":"IF(E63=E309,F309,)","v":0}]
[null,null,null,"Sátão",247,0,{"$f":"IF(E63=E310,F310,)","v":0}]
[null,null,null,"Seia",248,0,{"$f":"IF(E63=E311,F311,)","v":0}]
[null,null,null,"Seixal",249,0,{"$f":"IF(E63=E312,F312,)","v":0}]
[null,null,null,"Sernancelhe",250,0,{"$f":"IF(E63=E313,F313,)","v":0}]
[null,null,null,"Serpa",251,0,{"$f":"IF(E63=E314,F314,)","v":0}]
[null,null,null,"Sertã",252,0,{"$f":"IF(E63=E315,F315,)","v":0}]
[null,null,null,"Sesimbra",253,0,{"$f":"IF(E63=E316,F316,)","v":0}]
[null,null,null,"Setúbal",254,0,{"$f":"IF(E63=E317,F317,)","v":0}]
[null,null,null,"Sever do Vouga",255,0,{"$f":"IF(E63=E318,F318,)","v":0}]
[null,null,null,"Silves",256,0,{"$f":"IF(E63=E319,F319,)","v":0}]
[null,null,null,"Sines ",257,5.0000000000000001E-3,{"$f":"IF(E63=E320,F320,)","v":0}]
[null,null,null,"Sintra",258,0.01,{"$f":"IF(E63=E321,F321,)","v":0}]
[null,null,null,"Sobral de Monte Agraço",259,0,{"$f":"IF(E63=E322,F322,)","v":0}]
[null,null,null,"Soure",260,0,{"$f":"IF(E63=E323,F323,)","v":0}]
[null,null,null,"Sousel ",261,0,{"$f":"IF(E63=E324,F324,)","v":0}]
[null,null,null,"Tábua",262,0,{"$f":"IF(E63=E325,F325,)","v":0}]
[null,null,null,"Tabuaço",263,0,{"$f":"IF(E63=E326,F326,)","v":0}]
[null,null,null,"Tarouca",264,0,{"$f":"IF(E63=E327,F327,)","v":0}]
[null,null,null,"Tavira",265,0,{"$f":"IF(E63=E328,F328,)","v":0}]
[null,null,null,"Terras de Bouro",266,0,{"$f":"IF(E63=E329,F329,)","v":0}]
[null,null,null,"Tomar",267,0,{"$f":"IF(E63=E330,F330,)","v":0}]
[null,null,null,"Tondela",268,0,{"$f":"IF(E63=E331,F331,)","v":0}]
[null,null,null,"Torre de Moncorvo",269,0,{"$f":"IF(E63=E332,F332,)","v":0}]
[null,null,null,"Torres Novas",270,0,{"$f":"IF(E63=E333,F333,)","v":0}]
[null,null,null,"Torres Vedras",271,0,{"$f":"IF(E63=E334,F334,)","v":0}]
[null,null,null,"Trancoso",272,2.5000000000000001E-2,{"$f":"IF(E63=E335,F335,)","v":0}]
[null,null,null,"Trofa",273,0,{"$f":"IF(E63=E336,F336,)","v":0}]
[null,null,null,"Vagos",274,5.0000000000000001E-3,{"$f":"IF(E63=E337,F337,)","v":0}]
[null,null,null,"Vale de Cambra ",275,1.2E-2,{"$f":"IF(E63=E338,F338,)","v":0}]
[null,null,null,"Valença",276,0.03,{"$f":"IF(E63=E339,F339,)","v":0}]
[null,null,null,"Valongo",277,0,{"$f":"IF(E63=E340,F340,)","v":0}]
[null,null,null,"Valpaços",278,0,{"$f":"IF(E63=E341,F341,)","v":0}]
[null,null,null,"Velas",279,2.5000000000000001E-2,{"$f":"IF(E63=E342,F342,)","v":0}]
[null,null,null,"Vendas Novas",280,0,{"$f":"IF(E63=E343,F343,)","v":0}]
[null,null,null,"Viana do Alentejo",281,0,{"$f":"IF(E63=E344,F344,)","v":0}]
[null,null,null,"Viana do Castelo",282,0,{"$f":"IF(E63=E345,F345,)","v":0}]
[null,null,null,"Vidigueira ",283,0,{"$f":"IF(E63=E346,F346,)","v":0}]
[null,null,null,"Vieira do Minho",284,0,{"$f":"IF(E63=E347,F347,)","v":0}]
[null,null,null,"Vila de Rei",285,2.5000000000000001E-2,{"$f":"IF(E63=E348,F348,)","v":0}]
[null,null,null,"Vila do Bispo",286,0,{"$f":"IF(E63=E349,F349,)","v":0}]
[null,null,null,"Vila do Conde",287,0,{"$f":"IF(E63=E350,F350,)","v":0}]
[null,null,null,"Vila do Porto",288,0,{"$f":"IF(E63=E351,F351,)","v":0}]
[null,null,null,"Vila Flor",289,0.05,{"$f":"IF(E63=E352,F352,)","v":0}]
[null,null,null,"Vila Franca de Xira",290,0,{"$f":"IF(E63=E353,F353,)","v":0}]
[null,null,null,"Vila Franca do Campo",291,0,{"$f":"IF(E63=E354,F354,)","v":0}]
[null,null,null,"Vila Nova da Barquinha",292,5.0000000000000001E-3,{"$f":"IF(E63=E355,F355,)","v":0}]
[null,null,null,"Vila Nova de Cerveira",293,2.5000000000000001E-2,{"$f":"IF(E63=E356,F356,)","v":0}]
[null,null,null,"Vila Nova de Famalicão",294,0,{"$f":"IF(E63=E357,F357,)","v":0}]
[null,null,null,"Vila Nova de Foz Côa ",295,0,{"$f":"IF(E63=E358,F358,)","v":0}]
[null,null,null,"Vila Nova de Gaia",296,0,{"$f":"IF(E63=E359,F359,)","v":0}]
[null,null,null,"Vila Nova de Paiva",297,0,{"$f":"IF(E63=E360,F360,)","v":0}]
[null,null,null,"Vila Nova de Poiares",298,0,{"$f":"IF(E63=E361,F361,)","v":0}]
[null,null,null,"Vila Pouca de Aguiar",299,0,{"$f":"IF(E63=E362,F362,)","v":0}]
[null,null,null,"Vila Real ",300,0,{"$f":"IF(E63=E363,F363,)","v":0}]
[null,null,null,"Vila Real de Santo António",301,0,{"$f":"IF(E63=E364,F364,)","v":0}]
[null,null,null,"Vila Velha de Ródão",302,0,{"$f":"IF(E63=E365,F365,)","v":0}]
[null,null,null,"Vila Verde",303,0,{"$f":"IF(E63=E366,F366,)","v":0}]
[null,null,null,"Vila Viçosa ",304,0.02,{"$f":"IF(E63=E367,F367,)","v":0}]
[null,null,null,"Vimioso",305,0,{"$f":"IF(E63=E368,F368,)","v":0}]
[null,null,null,"Vinhais",306,0.02,{"$f":"IF(E63=E369,F369,)","v":0}]
[null,null,null,"Viseu",307,0.01,{"$f":"IF(E63=E370,F370,)","v":0}]
[null,null,null,"Vizela ",308,0,{"$f":"IF(E63=E371,F371,)","v":0}]
[null,null,null,"Vouzela ",309,0,{"$f":"IF(E63=E372,F372,)","v":0}]
[null,null,null,null,null,{"$f":"SUM(G65:G372)","v":0}]
[]
[]
[]
[null,"FIM"]

{"sheet":"Anexo A","index":2,"n_rows":269,"n_cols":27,"rows_kept":269,"cut":false,"hidden":false,"merged":[[201,1,201,2],[202,1,202,2],[201,3,201,4],[201,5,201,6],[201,7,201,8],[201,9,201,10],[200,3,200,4],[200,5,200,6],[201,11,201,12],[201,13,201,14],[203,1,203,2],[204,1,204,2],[203,3,203,4],[203,5,203,6],[203,7,203,8],[203,9,203,10],[203,11,203,12],[203,13,203,14],[202,3,202,4],[202,5,202,6],[202,7,202,8],[202,9,202,10],[202,11,202,12],[202,13,202,14],[204,3,204,4],[204,5,204,6],[192,7,192,8],[192,9,192,10],[192,11,192,12],[192,13,192,14],[191,3,191,4],[3,22,3,23],[3,24,3,25],[200,1,200,2],[193,13,193,14],[190,1,190,2],[191,1,191,2],[192,1,192,2],[193,1,193,2],[194,1,194,2],[195,1,195,2],[196,1,196,2],[197,1,197,2],[192,3,192,4],[193,3,193,4],[194,4,194,5],[195,4,195,5],[196,4,196,5],[193,5,193,6],[195,6,195,7],[196,6,196,7],[194,9,194,10],[195,9,195,10],[196,9,196,10],[190,3,190,4],[190,5,190,6],[190,7,190,8],[190,9,190,10],[190,11,190,12],[185,1,185,2],[186,1,186,2],[191,13,191,14],[183,13,183,14],[184,6,184,7],[185,6,185,7],[186,6,186,7],[184,9,184,10],[185,9,185,10],[186,9,186,10],[181,11,181,12],[180,13,180,14],[181,13,181,14],[190,13,190,14],[3,18,3,19],[3,20,3,21],[164,16,164,17],[164,13,164,14],[163,10,163,11],[154,13,154,14],[154,9,154,10],[153,3,153,4],[153,5,153,6],[162,13,162,14],[163,13,163,14],[165,1,165,2],[166,1,166,2],[158,1,158,2],[159,1,159,2],[160,1,160,2],[161,1,161,2],[193,7,193,8],[193,9,193,10],[193,11,193,12],[170,3,170,4],[170,5,170,6],[170,7,170,8],[170,9,170,10],[170,13,170,14],[174,4,174,5],[175,4,175,5],[176,4,176,5],[174,6,174,7],[175,6,175,7],[176,6,176,7],[143,10,143,11],[175,9,175,10],[176,9,176,10],[174,9,174,10],[152,9,152,10],[152,11,152,12],[162,8,162,9],[163,8,163,9],[164,8,164,9],[162,10,162,11],[153,7,153,8],[153,9,153,10],[153,11,153,12],[172,5,172,6],[172,7,172,8],[172,9,172,10],[172,11,172,12],[144,13,144,14],[194,6,194,7],[184,1,184,2],[180,3,180,4],[180,5,180,6],[180,7,180,8],[180,9,180,10],[180,11,180,12],[180,1,180,2],[181,1,181,2],[182,1,182,2],[183,1,183,2],[181,3,181,4],[181,5,181,6],[182,3,182,4],[182,5,182,6],[182,7,182,8],[181,7,181,8],[181,9,181,10],[183,3,183,4],[183,5,183,6],[183,7,183,8],[183,9,183,10],[183,11,183,12],[187,1,187,2],[192,5,192,6],[191,5,191,6],[191,7,191,8],[191,9,191,10],[191,11,191,12],[184,4,184,5],[185,4,185,5],[186,4,186,5],[158,24,158,25],[159,24,159,25],[159,11,159,12],[160,3,160,4],[160,5,160,6],[160,7,160,8],[160,9,160,10],[160,11,160,12],[157,5,157,6],[157,3,157,4],[157,7,157,8],[157,9,157,10],[159,9,159,10],[158,22,158,23],[159,22,159,23],[160,22,160,23],[158,19,158,20],[159,19,159,20],[160,19,160,20],[158,17,158,18],[159,17,159,18],[160,17,160,18],[158,15,158,16],[159,15,159,16],[160,15,160,16],[158,13,158,14],[159,13,159,14],[160,13,160,14],[162,1,162,2],[163,1,163,2],[159,3,159,4],[164,1,164,2],[159,5,159,6],[159,7,159,8],[161,3,161,4],[161,11,161,12],[162,4,162,5],[163,4,163,5],[164,4,164,5],[162,6,162,7],[163,6,163,7],[164,6,164,7],[164,10,164,11],[157,1,157,2],[162,16,162,17],[163,16,163,17],[149,1,149,2],[150,1,150,2],[151,1,151,2],[152,1,152,2],[153,1,153,2],[154,1,154,2],[152,3,152,4],[152,5,152,6],[152,7,152,8],[149,13,149,14],[140,7,140,8],[140,9,140,10],[140,11,140,12],[140,13,140,14],[142,7,142,8],[142,9,142,10],[142,11,142,12],[142,13,142,14],[146,1,146,2],[141,3,141,4],[141,5,141,6],[141,7,141,8],[141,9,141,10],[141,11,141,12],[141,13,141,14],[143,5,143,6],[144,5,144,6],[145,5,145,6],[143,7,143,8],[144,7,144,8],[145,13,145,14],[154,3,154,4],[136,1,136,2],[153,13,153,14],[154,5,154,6],[154,7,154,8],[139,1,139,2],[140,1,140,2],[141,1,141,2],[142,1,142,2],[143,1,143,2],[144,1,144,2],[145,1,145,2],[139,3,139,4],[139,5,139,6],[140,3,140,4],[140,5,140,6],[142,3,142,4],[142,5,142,6],[139,7,139,8],[139,9,139,10],[139,11,139,12],[139,13,139,14],[145,7,145,8],[144,10,144,11],[145,10,145,11],[152,13,152,14],[149,3,149,4],[149,5,149,6],[149,7,149,8],[149,9,149,10],[149,11,149,12],[151,3,151,4],[154,11,154,12],[135,5,135,6],[133,7,133,8],[134,7,134,8],[135,7,135,8],[129,13,129,14],[127,3,127,4],[127,5,127,6],[127,7,127,8],[127,9,127,10],[127,11,127,12],[127,13,127,14],[134,13,134,14],[131,3,131,4],[131,5,131,6],[131,7,131,8],[131,9,131,10],[131,11,131,12],[131,13,131,14],[128,3,128,4],[128,5,128,6],[128,7,128,8],[128,9,128,10],[128,11,128,12],[128,13,128,14],[129,3,129,4],[129,5,129,6],[129,7,129,8],[129,9,129,10],[120,3,120,4],[133,1,133,2],[134,1,134,2],[132,3,132,4],[132,5,132,6],[132,7,132,8],[132,9,132,10],[127,1,127,2],[129,1,129,2],[128,1,128,2],[130,1,130,2],[131,1,131,2],[132,1,132,2],[133,10,133,11],[134,10,134,11],[132,11,132,12],[129,11,129,12],[130,5,130,6],[133,5,133,6],[134,5,134,6],[119,1,119,2],[120,1,120,2],[119,3,119,4],[119,5,119,6],[119,7,119,8],[119,9,119,10],[116,3,116,4],[116,5,116,6],[116,7,116,8],[116,9,116,10],[117,9,117,10],[120,9,120,10],[120,5,120,6],[120,7,120,8],[135,1,135,2],[116,11,116,12],[116,13,116,14],[121,5,121,6],[122,5,122,6],[123,5,123,6],[121,7,121,8],[122,7,122,8],[123,7,123,8],[122,10,122,11],[123,10,123,11],[119,11,119,12],[119,13,119,14],[121,1,121,2],[122,1,122,2],[123,1,123,2],[124,1,124,2],[118,3,118,4],[116,1,116,2],[117,1,117,2],[118,1,118,2],[111,5,111,6],[112,5,112,6],[110,7,110,8],[111,7,111,8],[112,7,112,8],[111,10,111,11],[112,10,112,11],[72,13,72,14],[77,5,77,6],[78,5,78,6],[79,5,79,6],[77,7,77,8],[78,7,78,8],[79,7,79,8],[77,10,77,11],[78,12,78,13],[79,12,79,13],[118,5,118,6],[117,3,117,4],[117,5,117,6],[117,7,117,8],[117,13,117,14],[78,10,78,11],[79,10,79,11],[75,13,75,14],[73,13,73,14],[74,13,74,14],[76,13,76,14],[80,1,80,2],[75,3,75,4],[75,5,75,6],[75,7,75,8],[75,9,75,10],[75,11,75,12],[77,1,77,2],[78,1,78,2],[79,1,79,2],[61,7,61,8],[61,9,61,10],[61,11,61,12],[61,13,61,14],[72,1,72,2],[73,1,73,2],[74,1,74,2],[76,1,76,2],[73,3,73,4],[73,5,73,6],[73,7,73,8],[73,9,73,10],[73,11,73,12],[74,3,74,4],[74,5,74,6],[74,7,74,8],[74,9,74,10],[74,11,74,12],[76,3,76,4],[76,5,76,6],[76,7,76,8],[76,9,76,10],[76,11,76,12],[72,3,72,4],[66,1,66,2],[72,5,72,6],[72,7,72,8],[72,9,72,10],[72,11,72,12],[67,1,67,2],[68,1,68,2],[69,1,69,2],[64,3,64,4],[64,5,64,6],[64,7,64,8],[64,9,64,10],[64,11,64,12],[66,5,66,6],[67,5,67,6],[68,5,68,6],[66,7,66,8],[67,7,67,8],[68,7,68,8],[66,10,66,11],[67,10,67,11],[68,10,68,11],[67,12,67,13],[68,12,68,13],[65,3,65,4],[65,5,65,6],[65,7,65,8],[65,9,65,10],[61,3,61,4],[61,5,61,6],[62,3,62,4],[62,5,62,6],[62,7,62,8],[62,9,62,10],[62,11,62,12],[62,13,62,14],[63,3,63,4],[63,5,63,6],[63,7,63,8],[63,9,63,10],[63,11,63,12],[58,9,58,10],[63,13,63,14],[65,11,65,12],[65,13,65,14],[50,13,50,14],[47,1,47,2],[48,1,48,2],[50,1,50,2],[134,17,134,18],[135,17,135,18],[57,3,57,4],[57,5,57,6],[57,7,57,8],[57,9,57,10],[47,3,47,4],[47,5,47,6],[47,7,47,8],[47,9,47,10],[47,11,47,12],[47,13,47,14],[51,5,51,6],[52,5,52,6],[53,5,53,6],[51,7,51,8],[52,7,52,8],[53,7,53,8],[51,10,51,11],[58,3,58,4],[58,5,58,6],[58,7,58,8],[65,1,65,2],[61,1,61,2],[62,1,62,2],[64,1,64,2],[63,1,63,2],[64,13,64,14],[26,16,26,17],[25,24,25,25],[23,16,23,17],[23,18,23,19],[23,20,23,21],[23,22,23,23],[23,24,23,25],[24,14,24,15],[24,16,24,17],[51,1,51,2],[52,1,52,2],[53,1,53,2],[54,1,54,2],[49,3,49,4],[49,5,49,6],[49,7,49,8],[49,9,49,10],[49,11,49,12],[52,10,52,11],[53,10,53,11],[49,13,49,14],[48,3,48,4],[48,5,48,6],[48,7,48,8],[48,9,48,10],[48,11,48,12],[48,13,48,14],[50,3,50,4],[50,5,50,6],[50,7,50,8],[50,9,50,10],[50,11,50,12],[29,16,29,17],[29,18,29,19],[29,20,29,21],[29,22,29,23],[29,24,29,25],[30,14,30,15],[30,16,30,17],[30,18,30,19],[30,20,30,21],[30,22,30,23],[27,24,27,25],[28,14,28,15],[28,16,28,17],[28,18,28,19],[28,20,28,21],[28,22,28,23],[28,24,28,25],[26,18,26,19],[26,20,26,21],[26,22,26,23],[26,24,26,25],[27,14,27,15],[27,16,27,17],[27,18,27,19],[27,20,27,21],[27,22,27,23],[16,13,17,13],[18,1,18,6],[24,11,24,12],[29,13,30,13],[20,14,20,15],[23,14,23,15],[26,14,26,15],[29,14,29,15],[17,14,17,15],[21,24,21,25],[22,14,22,15],[22,16,22,17],[22,18,22,19],[22,20,22,21],[22,22,22,23],[22,24,22,25],[20,16,20,17],[20,18,20,19],[20,20,20,21],[20,22,20,23],[30,24,30,25],[19,14,19,16],[19,18,19,19],[20,24,20,25],[21,14,21,15],[21,16,21,17],[21,18,21,19],[21,20,21,21],[21,22,21,23],[24,24,24,25],[25,14,25,15],[25,16,25,17],[25,18,25,19],[25,20,25,21],[25,22,25,23],[15,14,15,15],[15,16,15,17],[15,18,15,19],[15,20,15,21],[15,22,15,23],[15,24,15,25],[24,18,24,19],[24,20,24,21],[24,22,24,23],[19,20,19,21],[19,22,19,23],[19,24,19,25],[14,14,14,15],[14,16,14,17],[14,18,14,19],[14,20,14,21],[14,22,14,23],[14,24,14,25],[17,16,17,17],[17,18,17,19],[17,20,17,21],[17,22,17,23],[17,24,17,25],[16,14,16,15],[16,16,16,17],[16,18,16,19],[16,20,16,21],[16,22,16,23],[16,24,16,25],[11,14,11,15],[11,16,11,17],[11,18,11,19],[11,20,11,21],[11,22,11,23],[11,24,11,25],[10,14,10,15],[10,16,10,17],[10,18,10,19],[10,20,10,21],[10,22,10,23],[10,24,10,25],[13,14,13,15],[13,16,13,17],[13,18,13,19],[13,20,13,21],[13,22,13,23],[13,24,13,25],[12,14,12,15],[12,16,12,17],[12,18,12,19],[12,20,12,21],[12,22,12,23],[12,24,12,25],[6,14,6,15],[6,16,6,17],[6,18,6,19],[6,20,6,21],[6,22,6,23],[6,24,6,25],[5,22,5,23],[5,24,5,25],[4,14,4,16],[4,18,4,19],[4,20,4,21],[4,22,4,23],[9,14,9,15],[9,16,9,17],[9,18,9,19],[9,20,9,21],[9,22,9,23],[9,24,9,25],[8,14,8,15],[8,16,8,17],[8,18,8,19],[8,20,8,21],[8,22,8,23],[8,24,8,25],[83,1,83,2],[84,1,84,2],[85,1,85,2],[87,1,87,2],[88,1,88,2],[86,1,86,2],[89,1,89,2],[90,1,90,2],[91,1,91,2],[0,23,1,24],[37,25,37,26],[37,1,37,2],[37,4,37,5],[37,7,37,8],[37,10,37,11],[37,13,37,14],[37,16,37,17],[37,19,37,20],[37,22,37,23],[3,1,3,6],[5,14,5,15],[5,16,5,17],[5,18,5,19],[5,20,5,21],[7,14,7,15],[7,16,7,17],[7,18,7,19],[7,20,7,21],[7,22,7,23],[7,24,7,25],[4,24,4,25],[86,7,86,8],[92,1,92,2],[84,3,84,4],[84,5,84,6],[84,7,84,8],[87,3,87,4],[87,5,87,6],[87,7,87,8],[87,9,87,10],[87,11,87,12],[88,3,88,4],[88,5,88,6],[88,7,88,8],[88,9,88,10],[88,11,88,12],[91,5,91,6],[91,10,91,11],[91,7,91,8],[89,10,89,11],[97,7,97,8],[97,9,97,10],[97,11,97,12],[95,3,95,4],[95,5,95,6],[95,7,95,8],[95,9,95,10],[95,11,95,12],[105,1,105,2],[83,3,83,4],[83,5,83,6],[83,7,83,8],[83,9,83,10],[83,11,83,12],[83,13,83,14],[89,5,89,6],[90,5,90,6],[90,10,90,11],[89,7,89,8],[90,7,90,8],[87,13,87,14],[84,9,84,10],[84,11,84,12],[84,13,84,14],[85,3,85,4],[85,5,85,6],[85,7,85,8],[85,9,85,10],[85,11,85,12],[85,13,85,14],[86,3,86,4],[86,5,86,6],[134,15,134,16],[135,15,135,16],[90,12,90,13],[91,12,91,13],[97,13,97,14],[96,13,96,14],[98,13,98,14],[95,13,95,14],[101,10,101,11],[120,13,120,14],[132,13,132,14],[99,10,99,11],[110,10,110,11],[121,10,121,11],[135,10,135,11],[117,11,117,12],[120,11,120,12],[105,11,105,12],[108,9,108,10],[135,13,135,14],[105,13,105,14],[105,7,105,8],[105,9,105,10],[88,13,88,14],[99,1,99,2],[100,1,100,2],[101,1,101,2],[102,1,102,2],[96,3,96,4],[96,5,96,6],[96,7,96,8],[96,9,96,10],[96,11,96,12],[98,3,98,4],[98,5,98,6],[98,7,98,8],[98,9,98,10],[98,11,98,12],[99,5,99,6],[100,5,100,6],[101,5,101,6],[100,12,100,13],[101,12,101,13],[99,7,99,8],[100,7,100,8],[101,7,101,8],[100,10,100,11],[95,1,95,2],[96,1,96,2],[97,1,97,2],[98,1,98,2],[97,3,97,4],[97,5,97,6],[111,1,111,2],[112,1,112,2],[113,1,113,2],[106,9,106,10],[106,11,106,12],[106,13,106,14],[109,3,109,4],[109,5,109,6],[109,7,109,8],[109,9,109,10],[109,11,109,12],[109,13,109,14],[108,11,108,12],[108,13,108,14],[107,3,107,4],[107,5,107,6],[107,7,107,8],[106,3,106,4],[106,5,106,6],[106,7,106,8],[110,1,110,2],[106,1,106,2],[107,1,107,2],[108,1,108,2],[109,1,109,2],[108,3,108,4],[108,5,108,6],[108,7,108,8],[110,5,110,6],[105,3,105,4],[105,5,105,6],[205,1,205,2],[206,1,206,2],[207,1,207,2],[208,1,208,2],[172,13,172,14],[170,1,170,2],[171,1,171,2],[172,1,172,2],[173,1,173,2],[173,3,173,4],[173,5,173,6],[173,7,173,8],[173,9,173,10],[173,11,173,12],[173,13,173,14],[174,1,174,2],[175,1,175,2],[176,1,176,2],[177,1,177,2],[172,3,172,4],[171,3,171,4],[171,5,171,6],[171,7,171,8],[171,9,171,10],[170,11,170,12],[171,11,171,12],[171,13,171,14],[182,9,182,10],[182,11,182,12],[182,13,182,14],[211,1,211,2],[212,1,212,2],[213,1,213,2],[214,1,214,2],[215,1,215,2],[213,3,213,4],[213,5,213,6],[213,7,213,8],[213,9,213,10],[213,11,213,12],[213,13,213,14],[214,3,214,4],[214,5,214,6],[214,7,214,8],[214,9,214,10],[214,11,214,12],[214,13,214,14],[215,3,215,4],[215,5,215,6],[218,6,218,7],[215,7,215,8],[215,9,215,10],[215,11,215,12],[215,13,215,14],[211,3,211,4],[211,5,211,6],[211,7,211,8],[211,9,211,10],[211,11,211,12],[211,13,211,14],[203,22,203,23],[206,12,206,13],[207,12,207,13],[212,3,212,4],[212,5,212,6],[212,7,212,8],[212,9,212,10],[212,11,212,12],[212,13,212,14],[204,13,204,14],[205,4,205,5],[206,4,206,5],[207,4,207,5],[205,6,205,7],[206,6,206,7],[207,6,207,7],[206,9,206,10],[207,9,207,10],[205,9,205,10],[206,16,207,16],[227,13,227,14],[200,13,200,14],[222,1,222,2],[223,1,223,2],[224,1,224,2],[225,1,225,2],[226,1,226,2],[227,1,227,2],[222,3,222,4],[222,5,222,6],[222,7,222,8],[222,9,222,10],[222,11,222,12],[222,13,222,14],[216,9,216,10],[217,9,217,10],[218,9,218,10],[204,7,204,8],[200,7,200,8],[204,9,204,10],[200,9,200,10],[204,11,204,12],[200,11,200,12],[216,1,216,2],[217,1,217,2],[218,1,218,2],[219,1,219,2],[216,4,216,5],[217,4,217,5],[218,4,218,5],[216,6,216,7],[217,6,217,7],[223,3,223,4],[223,5,223,6],[223,7,223,8],[223,9,223,10],[223,11,223,12],[223,13,223,14],[226,3,226,4],[226,5,226,6],[226,7,226,8],[226,9,226,10],[226,11,226,12],[226,13,226,14],[224,3,224,4],[225,3,225,4],[225,5,225,6],[224,5,224,6],[224,7,224,8],[224,9,224,10],[224,11,224,12],[224,13,224,14],[228,1,228,2],[229,1,229,2],[230,1,230,2],[231,1,231,2],[227,3,227,4],[227,5,227,6],[227,7,227,8],[227,9,227,10],[227,11,227,12],[228,4,228,5],[229,4,229,5],[230,4,230,5],[230,6,230,7],[228,9,228,10],[229,9,229,10],[230,9,230,10],[228,6,228,7],[229,6,229,7],[235,5,235,6],[235,7,235,8],[235,9,235,10],[235,11,235,12],[235,13,235,14],[237,3,237,4],[237,5,237,6],[237,7,237,8],[237,9,237,10],[237,11,237,12],[237,13,237,14],[234,1,234,2],[235,1,235,2],[236,1,236,2],[237,1,237,2],[236,3,236,4],[236,5,236,6],[236,7,236,8],[236,9,236,10],[236,11,236,12],[234,3,234,4],[234,5,234,6],[234,7,234,8],[234,9,234,10],[234,11,234,12],[245,1,245,2],[246,1,246,2],[247,1,247,2],[248,1,248,2]],"merged_total":1104,"flags":["merged_cut"]}
[]
[]
[]
[null,"QUADRO 4A"]
[null,"RENDIMENTOS, RETENÇÕES, CONTRIBUIÇÕES OBRIGATÓRIAS, QUOTIZAÇÕES SINDICAIS",null,null,null,null,null,null,null,null,null,null,null,null,{"$f":"TEXT(B43,)","v":""},null,null,"☞","Não deficiente",null,"Não deficiente",null,"Não deficiente",null,"Não deficiente"]
[null,"TRABALHO DEPENDENTE - [Artigo 2.º do Código do IRS] ",null,null,null,null,null,null,null,null,null,null,null,"Código","Sujeito Passivo A",null,"Sujeito Passivo B",null,"Dependente 1",null,"Dependente 2",null,"Dependente 3",null,"Dependente 4"]
[null,"Trabalho dependente – Rendimento bruto          ",null,null,null,null,null,null,null,null,null,null,null,401]
[null,"Gratificações não atribuídas pela entidade  patronal",null,null,null,null,null,null,null,null,null,null,null,402]
[null,"Subsídios pagos pelas associações humanitárias de Bombeiros  [Atividade voluntária]",null,null,null,null,null,null,null,null,null,null,null,408]
[null,"Indemnizações pagas pelo trabalhador ao patrão",null,null,null,null,null,null,null,null,null,null,null,421]
[null,"Quotizações para ordens profissionais",null,null,null,null,null,null,null,null,null,null,null,422]
[null,"Despesas de valorização profissional de juízes",null,null,null,null,null,null,null,null,null,null,null,423]
[null,"Prémios de seguros profissões desgaste rápido",null,null,null,null,null,null,null,null,null,null,null,424]
[null,"Quotizações sindicais  [Valor Pago]"]
[null,"Retenções  na fonte de IRS"]
[null,"Contribuições para a segurança social incluindo a CPAS ✚ Subsistemas de saúde [ADSE, ADME, ADMA, ADMFA, SAMS, SAD/GNR, SAD/PSP]"]
[null,"Rendimentos de anos anteriores  [Incluídos no Código 401 do Anexo A]",null,null,null,null,null,null,null,null,null,null,null,"Quadro 5"]
[null,"Indique o N.º de anos"]
[]
[null,"RENDIMENTOS, RETENÇÕES, CONTRIBUIÇÕES OBRIGATÓRIAS, QUOTIZAÇÕES SINDICAIS",null,null,null,null,null,null,null,null,null,null,null,null,{"$f":"TEXT(B44,)","v":""},null,null,"☞","Não deficiente",null,"Não deficiente",null,"Não deficiente",null,"Não deficiente"]
[null,"PENSÕES - [Artigos 11.º e 53.º do Código do IRS] ",null,null,null,null,null,null,null,null,null,null,null,"Código","Sujeito Passivo A",null,"Sujeito Passivo B",null,"Dependente 1",null,"Dependente 2",null,"Dependente 3",null,"Dependente 4"]
[null,"Pensões  [Com exceção das Pensões de Sobrevivência e Alimentos]                    ",null,null,null,null,null,null,null,null,null,null,null,403]
[null,"Pensões de sobrevivência ",null,null,null,null,null,null,null,null,null,null,null,404]
[null,"Pensões de alimentos  [Insira nesta linha as pensões de alimentos recebidas]",null,null,null,null,null,null,null,null,null,null,null,405]
[null,"Os sujeitos passivos optam pelo englobamento das pensões de alimentos ?                ",null,null,null,null,null,null,null,null,null," Indique ali a",null,"☞","Opção",null,{"$f":"O25","v":"Opção"},null,{"$f":"O25","v":"Opção"},null,{"$f":"O25","v":"Opção"},null,{"$f":"O25","v":"Opção"},null,{"$f":"O25","v":"Opção"}]
[null,"Rendas temporárias e vitalícias",null,null,null,null,null,null,null,null,null,null,null,406]
[null,"Quotizações sindicais  [Valor Pago]"]
[null,"Retenções  na fonte de IRS"]
[null,"Contribuições para a segurança social incluindo a CPAS ✚ Subsistemas de saúde  [ADSE, ADME, ADMA, ADMFA, SAMS, SAD/GNR, SAD/PSP]"]
[null,"Rendimentos de anos anteriores  [Incluídos no Código 403 do Anexo A]",null,null,null,null,null,null,null,null,null,null,null,"Quadro 5"]
[null,"Indique o N.º de anos"]
[]
[]
[]
[]
[null,"INÍCIO"]
[]
[null,"Dep. 1 deficiente Cat. A",null,null,"Dep. 2  deficiente Cat. A",null,null,"Dep. 3  deficiente Cat. A",null,null,"Dep. 4 deficiente Cat. A",null,null,"Dep. 1 deficiente Cat. H",null,null,"Dep. 2 deficiente Cat. H",null,null,"Dep. 3 deficiente Cat. H",null,null,"Dep. 4 deficiente Cat. H",null,null,"Pensões de alimentos Opção englobamento "]
[null,"Não deficiente",2,null,"Não deficiente",2,null,"Não deficiente",2,null,"Não deficiente",2,null,"Não deficiente",2,null,"Não deficiente",2,null,"Não deficiente",2,null,"Não deficiente",2,null,"Opção",1]
[null,"Deficiente ≥ 60%",3,null,"Deficiente ≥ 60%",3,null,"Deficiente ≥ 60%",3,null,"Deficiente ≥ 60%",3,null,"Deficiente ≥ 60%",3,null,"Deficiente ≥ 60%",3,null,"Deficiente ≥ 60%",3,null,"Deficiente ≥ 60%",3,null,"Sim",2]
[null,null,{"$f":"VLOOKUP(S5,B39:C40,2,FALSE)","v":2},null,null,{"$f":"VLOOKUP(U5,E39:F40,2,FALSE)","v":2},null,null,{"$f":"VLOOKUP(W5,H39:I40,2,FALSE)","v":2},null,null,{"$f":"VLOOKUP(Y5,K39:L40,2,FALSE)","v":2},null,null,{"$f":"VLOOKUP(S20,N39:O40,2,FALSE)","v":2},null,null,{"$f":"VLOOKUP(U20,Q39:R40,2,FALSE)","v":2},null,null,{"$f":"VLOOKUP(W20,T39:U40,2,FALSE)","v":2},null,null,{"$f":"VLOOKUP(Y20,W39:X40,2,FALSE)","v":2},null,"Não ",3]
[null,null,null,null,null,null,null,null,null,null,null,null,null,null,null,null,null,null,null,null,null,null,null,null,null,null,{"$f":"VLOOKUP(O25,Z39:AA41,2,FALSE)","v":1}]
[null,{"$f":"IF(L43=2,\"Indique ali qual dos dependentes é deficiente ≥ 60% ? \",)","v":0},null,null,null,null,null,null,null,{"$f":"IF('Modelo 3'!J20+'Modelo 3'!J21+'Modelo 3'!J22+'Modelo 3'!J23+'Modelo 3'!K20+'Modelo 3'!K21+'Modelo 3'!K22+'Modelo 3'!K23>=1,1,)","v":0},{"$f":"IF(S7+U7+W7+Y7>=1,1,)","v":0},{"$f":"SUM(J43:K43)","v":0}]
[null,{"$f":"IF(L44=2,\"Indique ali qual dos dependentes é deficiente ≥ 60% ?\",)","v":0},null,null,null,null,null,null,null,{"$f":"J43","v":0},{"$f":"IF(S22+S23+S24+S26+U22+U23+U24+U26+W22+W23+W24+W26+Y22+Y23+Y24+Y26>=1,1,)","v":0},{"$f":"SUM(J44:K44)","v":0}]
[null,{"$f":"IF(B55+B178+B188+B198+B209+N135+N136=0,\"➤\",IF(B55+B178+B188+B198+B209+N135+N136>=1,\"Tem\",))","v":"➤"}]
[null,"CATEGORIA A",null,null,null,null,null,null,null,null,null,null,null,null,null,null,null,{"$f":"'Modelo 3'!D38","v":1},{"$f":"'Modelo 3'!F52","v":1}]
[null,"Art.º 2.º  do CIRS - Rendimentos da Cat. A "]
[null,"T.  Separada →",null,{"$f":"IF(R48=1,D51,0)","v":0},null,{"$f":"IF(R48=1,F51,0)","v":0},null,{"$f":"IF(R48=1,H51/2,0)","v":0},null,{"$f":"IF(R48=1,J51/2,0)","v":0},null,{"$f":"IF(R48=1,L51/2,0)","v":0},null,{"$f":"IF(R48=1,N51/2,0)","v":0},null,null,null,{"$f":"R46","v":1},{"$f":"IF(S50=TRUE,4,IF(S51=TRUE,4,IF(S52=TRUE,1,S46)))","v":1},{"$f":"SUM('Anexo J'!L7)","v":0}]
[null,"Rendimento Bruto →",null,{"$f":"(O7+D59+T48)-D154","v":0},null,{"$f":"(Q7+F59+T49)-F154","v":0},null,{"$f":"(S7+H59)-H154","v":0},null,{"$f":"(U7+J59)-J154","v":0},null,{"$f":"W7-L154","v":0},null,{"$f":"Y7-N154","v":0},null,null,null,null,null,{"$f":"SUM('Anexo J'!N7)","v":0}]
[null,null,null,"Sujeito Passivo A ",null,"Sujeito Passivo B",null,"Dependente 1 ",null,"Dependente 2 ",null,"Dependente 3",null,"Dependente 4",null,null,null,null,{"$f":"'Modelo 3'!D43","v":0}]
[null,"SOMA TOTAL→",null,{"$f":"D49","v":0},null,{"$f":"F49","v":0},null,{"$f":"H49","v":0},null,{"$f":"J49","v":0},null,{"$f":"L49","v":0},null,{"$f":"N49","v":0},null,null,null,null,{"$f":"'Modelo 3'!E43","v":0}]
[null,"Continente (RB)",null,"SOMA",null,{"$f":"SUM(D51:O51)","v":0},null,{"$f":"IF(S48=1,F52,)","v":0},null,null,"T. Separada",null,null,null,null,null,null,null,{"$f":"'Modelo 3'!F43","v":0}]
[null,"Açores ",null,"SOMA",null,{"$f":"IF(F52<0,0,F52)","v":0},null,{"$f":"IF(S48=2,F53,)","v":0},null,"SP A→",{"$f":"IF(S48>=4,0,SUM(D48+H48+J48+L48+N48))","v":0}]
[null,"Madeira",null,"SOMA",null,{"$f":"IF(F52<0,0,F52)","v":0},null,{"$f":"IF(S48=3,F54,)","v":0},null,"SP B→",{"$f":"IF(S48>=4,0,SUM(F48+H48+J48+L48+N48))","v":0}]
[null,{"$f":"IF(F52<0,0,SUM(H52+H53+H54))","v":0},null,"← Rendimento Bruto "]
[null,"Cat. B - Opção pelos rendimentos da Cat. A "]
[null,null,null,{"$f":"IF('Anexo B'!C81=2,4,IF('Anexo B'!O81=2,4,))","v":0},null,{"$f":"IF('Anexo B'!F81=2,4,IF('Anexo B'!R81=2,4,))","v":0},null,{"$f":"IF('Anexo B'!I81=2,4,IF('Anexo B'!U81=2,4,))","v":0},null,{"$f":"IF('Anexo B'!L81=2,4,IF('Anexo B'!X81=2,4,))","v":0}]
[null,"Campos 403,404,408",null,"Sujeito Passivo A ",null,"Sujeito Passivo B",null,"Dependente 1 ",null,"Dependente 2 "]
[null,"Rendimento Bruto →",null,{"$f":"IF(D57=4,M59,0)","v":0},null,{"$f":"IF(F57=4,N59,0)","v":0},null,{"$f":"IF(H57=4,O59,0)","v":0},null,{"$f":"IF(J57=4,P59,0)","v":0},null,null,{"$f":"SUM('Anexo B'!Z16)","v":0},{"$f":"SUM('Anexo B'!AA16)","v":0},{"$f":"SUM('Anexo B'!AB16)","v":0},{"$f":"SUM('Anexo B'!AC16)","v":0}]
[]
[null,"Art.º 25.º do CIRS - Dedução específica da categoria A + Segurança Social",null,null,null,null,null,null,null,null,null,null,null,null,null,null,null,{"$f":"'Modelo 3'!J36","v":4104}]
[null,"T.  Separada →",null,{"$f":"IF(R62=1,D66,0)","v":0},null,{"$f":"IF(R62=1,F66,0)","v":0},null,{"$f":"IF(R62=1,H66/2,0)","v":0},null,{"$f":"IF(R62=1,J66/2,0)","v":0},null,{"$f":"IF(R62=1,L66/2,0)","v":0},null,{"$f":"IF(R62=1,N66/2,0)","v":0},null,{"$f":"IF(O16<=R61,R61,IF(O16>R61,O16,))","v":4104},{"$f":"IF(D57<=3,0,IF(D57=4,SUM('Anexo B'!P36+'Anexo B'!P55)))","v":0},{"$f":"R46","v":1},{"$f":"IF(S64=TRUE,4,IF(S65=TRUE,4,IF(S66=TRUE,1,S46)))","v":1},{"$f":"SUM('Anexo J'!L8)","v":0}]
[null,"Rendimento Bruto →",null,{"$f":"D49","v":0},null,{"$f":"F49","v":0},null,{"$f":"H49","v":0},null,{"$f":"J49","v":0},null,{"$f":"L49","v":0},null,{"$f":"N49","v":0},null,{"$f":"IF(Q16<=R61,R61,IF(Q16>R61,Q16,))","v":4104},{"$f":"IF(F57<=3,0,IF(F57=4,SUM('Anexo B'!R36+'Anexo B'!R55)))","v":0},null,null,{"$f":"SUM('Anexo J'!N8)","v":0}]
[null,"Limites →",null,{"$f":"IF(O16+T62+Q62<P62,P62,O16+T62+Q62)","v":4104},null,{"$f":"IF(Q16+T63+Q63<P63,P63,Q16+T63+Q63)","v":4104},null,{"$f":"IF(S16+Q64<P64,P64,S16+Q64)","v":4104},null,{"$f":"IF(U16+Q65<P65,P65,U16+Q65)","v":4104},null,{"$f":"IF(W29<P66,P66,W29)","v":4104},null,{"$f":"IF(Y16<P67,P67,Y16)","v":4104},null,{"$f":"IF(S16<=R61,R61,IF(S16>R61,S16,))","v":4104},{"$f":"IF(H57<=3,0,IF(H57=4,SUM('Anexo B'!T36)))","v":0},null,{"$f":"'Modelo 3'!D43","v":0}]
[null,null,null,"Sujeito Passivo A ",null,"Sujeito Passivo B",null,"Dependente 1 ",null,"Dependente 2 ",null,"Dependente 3",null,"Dependente 4",null,{"$f":"IF(U16<=R61,R61,IF(U16>R61,U16,))","v":4104},{"$f":"IF(J57<=3,0,IF(J57=4,SUM('Anexo B'!V36)))","v":0},null,{"$f":"'Modelo 3'!E43","v":0}]
[null,"SOMA TOTAL→",null,{"$f":"IF(D63<D64,D63,D64)","v":0},null,{"$f":"IF(F63<F64,F63,F64)","v":0},null,{"$f":"IF(H63<H64,H63,H64)","v":0},null,{"$f":"IF(J63<J64,J63,J64)","v":0},null,{"$f":"IF(L63<L64,L63,L64)","v":0},null,{"$f":"IF(N63<N64,N63,N64)","v":0},null,{"$f":"IF(W16<=R61,R61,IF(W16>R61,W16,))","v":4104},null,null,{"$f":"'Modelo 3'!F43","v":0}]
[null,"Continente (DE)",null,"SOMA",null,{"$f":"SUM(D66:O66)","v":0},null,{"$f":"IF(S62=1,F67,)","v":0},null,null,"T. Separada",null,null,null,null,{"$f":"IF(Y16<=R61,R61,IF(Y16>R61,Y16,))","v":4104}]
[null,"Açores ",null,"SOMA",null,{"$f":"IF(F67<0,0,F67)","v":0},null,{"$f":"IF(S62=2,F68,)","v":0},null,"SP A→",{"$f":"IF(S62>=4,0,SUM(D62+H62+J62+L62+N62))","v":0}]
[null,"Madeira",null,"SOMA",null,{"$f":"IF(F67<0,0,F67)","v":0},null,{"$f":"IF(S62=3,F69,)","v":0},null,"SP B→",{"$f":"IF(S62>=4,0,SUM(F62+H62+J62+L62+N62))","v":0}]
[null,{"$f":"IF(F67<0,0,SUM(H67+H68+H69))","v":0},null,"← Dedução Específica "]
[]
[null," Art.º 25.º do CIRS - Quotizações para ordens profissionais ",null,null,null,null,null,null,null,null,null,null,null,null,null,null,null,4275,{"$f":"R61","v":4104}]
[null,"T.  Separada →",null,{"$f":"IF(R73=1,D77,0)","v":0},null,{"$f":"IF(R73=1,F77,0)","v":0},null,{"$f":"IF(R73=1,H77/2,0)","v":0},null,{"$f":"IF(R73=1,J77/2,0)","v":0},null,{"$f":"IF(R73=1,L77/2,0)","v":0},null,{"$f":"IF(R73=1,N77/2,0)","v":0},null,{"$f":"IF(Q73>=1,0,IF(D66>S72,0,R72-S72))","v":171},{"$f":"SUM(+'Anexo B'!I124+'Anexo B'!I144+'Anexo B'!I180+'Anexo E'!I49+'Anexo F'!I45+'Anexo G'!I63+'Anexo G'!I87)","v":0},{"$f":"R46","v":1},{"$f":"IF(S74=TRUE,4,IF(S75=TRUE,4,IF(S76=TRUE,1,S46)))","v":1}]
[null,"Rendimento Bruto →",null,{"$f":"IF('Anexo A'!O7>=1,O11+'Anexo B'!P37,)","v":0},null,{"$f":"IF(Q7>=1,Q11+'Anexo B'!R37,)","v":0},null,{"$f":"IF(S7>=1,S11+'Anexo B'!T37,)","v":0},null,{"$f":"IF(U7>=1,U11+'Anexo B'!V37,)","v":0},null,{"$f":"IF(W7>=1,W11,)","v":0},null,{"$f":"IF(Y7>=1,Y11,)","v":0},null,{"$f":"IF(Q74>=1,0,IF(F66>S72,0,R72-S72))","v":171},{"$f":"SUM('Anexo B'!I125+'Anexo B'!I145+'Anexo E'!I50+'Anexo F'!I46+'Anexo G'!I64+'Anexo G'!I88)","v":0},null,{"$f":"'Modelo 3'!D43","v":0}]
[null,"Limites →",null,{"$f":"IF(D74>=1,P73,0)","v":0},null,{"$f":"IF(F74>=1,P74,0)","v":0},null,{"$f":"IF(H74>=1,P75,0)","v":0},null,{"$f":"IF(J74>=1,P76,0)","v":0},null,{"$f":"IF(L74>=1,P77,0)","v":0},null,{"$f":"IF(N74>=1,P78,0)","v":0},null,{"$f":"IF(Q75>=1,0,IF(H66>S72,0,R72-S72))","v":171},{"$f":"'Anexo B'!V118+'Anexo B'!J136","v":0},null,{"$f":"'Modelo 3'!E43","v":0}]
[null,null,null,"Sujeito Passivo A ",null,"Sujeito Passivo B",null,"Dependente 1 ",null,"Dependente 2 ",null,"Dependente 3",null,"Dependente 4",null,{"$f":"IF(Q76>=1,0,IF(J66>S72,0,R72-S72))","v":171},{"$f":"SUM('Anexo B'!AC118+'Anexo B'!L136)","v":0},null,{"$f":"'Modelo 3'!F43","v":0}]
[null,"SOMA TOTAL→",null,{"$f":"IF(D74<D75,D74,D75)","v":0},null,{"$f":"IF(F74<F75,F74,F75)","v":0},null,{"$f":"IF(H74<H75,H74,H75)","v":0},null,{"$f":"IF(J74<J75,J74,J75)","v":0},null,{"$f":"IF(L74<L75,L74,L75)","v":0},null,{"$f":"IF(N74<N75,N74,N75)","v":0},null,{"$f":"IF(L66>S72,0,R72-S72)","v":171}]
[null,"Continente (DE)",null,"SOMA",null,{"$f":"SUM(D77:O77)","v":0},null,{"$f":"IF(S73=1,F78,)","v":0},null,null,"T. Separada",null,null,null,null,{"$f":"IF(N66>S72,0,R72-S72)","v":171}]
[null,"Açores ",null,"SOMA",null,{"$f":"IF(F78<0,0,F78)","v":0},null,{"$f":"IF(S73=2,F79,)","v":0},null,"SP A→",{"$f":"IF(S73>=4,0,SUM(D73+H73+J73+L73+N73))","v":0}]
[null,"Madeira",null,"SOMA",null,{"$f":"IF(F78<0,0,F78)","v":0},null,{"$f":"IF(S73=3,F80,)","v":0},null,"SP B→",{"$f":"IF(S73>=4,0,SUM(F73+H73+J73+L73+N73))","v":0}]
[null,{"$f":"IF(F78<0,0,SUM(H78+H79+H80))","v":0},null,"← Dedução Específica "]
[]
[null," Art.º 25.º do CIRS - Quotizações Sindicais Cat. A",null,null,null,null,null,null,null,null,null,null,null,null,null,null,null,{"$f":"R46","v":1},{"$f":"IF(S84=TRUE,4,IF(S85=TRUE,4,IF(S86=TRUE,1,S46)))","v":1}]
[null,"T.  Separada →",null,{"$f":"IF(R83=1,D89,0)","v":0},null,{"$f":"IF(R83=1,F89,0)","v":0},null,{"$f":"IF(R83=1,H89/2,0)","v":0},null,{"$f":"IF(R83=1,J89/2,0)","v":0},null,{"$f":"IF(R83=1,L89/2,0)","v":0},null,{"$f":"IF(R83=1,N89/2,0)","v":0},null,null,null,null,{"$f":"'Modelo 3'!D43","v":0}]
[null,"Quot. Sindicais →",null,{"$f":"O14+'Anexo B'!P38","v":0},null,{"$f":"Q14+'Anexo B'!R38","v":0},null,{"$f":"S14+'Anexo B'!T38","v":0},null,{"$f":"U14+'Anexo B'!V38","v":0},null,{"$f":"W14","v":0},null,{"$f":"Y14","v":0},null,null,null,null,{"$f":"'Modelo 3'!E43","v":0}]
[null,"Rendimento Bruto →",null,{"$f":"D49","v":0},null,{"$f":"F49","v":0},null,{"$f":"H49","v":0},null,{"$f":"J49","v":0},null,{"$f":"L49","v":0},null,{"$f":"N49","v":0},null,null,null,null,{"$f":"'Modelo 3'!F43","v":0}]
[null,"Taxa →",null,0.01,null,1.5,null,{"$f":"R61","v":4104}]
[null,null,null,"Sujeito Passivo A ",null,"Sujeito Passivo B",null,"Dependente 1 ",null,"Dependente 2 ",null,"Dependente 3",null,"Dependente 4"]
[null,"SOMA TOTAL→",null,{"$f":"IF(D85>D86*D87,(D86*D87)*F87,D85*F87)","v":0},null,{"$f":"IF(F85>F86*D87,(F86*D87)*F87,F85*F87)","v":0},null,{"$f":"IF(H85>H86*D87,(H86*D87)*F87,H85*F87)","v":0},null,{"$f":"IF(J85>J86*D87,(J86*D87)*F87,J85*F87)","v":0},null,{"$f":"IF(L85>L86*D87,(L86*D87)*F87,L85*F87)","v":0},null,{"$f":"IF(N85>N86*D87,(N86*D87)*F87,N85*F87)","v":0}]
[null,"Continente (DE)",null,"SOMA",null,{"$f":"SUM(D89:O89)","v":0},null,{"$f":"IF(S83=1,F90,)","v":0},null,null,"T. Separada"]
[null,"Açores ",null,"SOMA",null,{"$f":"IF(F90<0,0,F90)","v":0},null,{"$f":"IF(S83=2,F91,)","v":0},null,"SP A→",{"$f":"IF(S83>=4,0,SUM(D84+H84+J84+L84+N84))","v":0}]
[null,"Madeira",null,"SOMA",null,{"$f":"IF(F90<0,0,F90)","v":0},null,{"$f":"IF(S83=3,F92,)","v":0},null,"SP B→",{"$f":"IF(S83>=4,0,SUM(F84+H84+J84+L84+N84))","v":0}]
[null,{"$f":"IF(F90<0,0,SUM(H90+H91+H92))","v":0},null,"← Dedução Específica "]
[]
[null,"Art.º 25.º do CIRS - Indemnizações pagas pelo trabalhador ao patrão",null,null,null,null,null,null,null,null,null,null,null,null,null,null,null,{"$f":"R46","v":1},{"$f":"IF(S96=TRUE,4,IF(S97=TRUE,4,IF(S98=TRUE,1,S46)))","v":1}]
[null,"T.  Separada →",null,{"$f":"IF(R95=1,D99,0)","v":0},null,{"$f":"IF(R95=1,F99,0)","v":0},null,{"$f":"IF(R95=1,H99/2,0)","v":0},null,{"$f":"IF(R95=1,J99/2,0)","v":0},null,{"$f":"IF(R95=1,L99/2,0)","v":0},null,{"$f":"IF(R95=1,N99/2,0)","v":0},null,null,null,null,{"$f":"'Modelo 3'!D43","v":0}]
[null,"Rendimento Bruto →",null,{"$f":"O10","v":0},null,{"$f":"Q10","v":0},null,{"$f":"S10","v":0},null,{"$f":"U10","v":0},null,{"$f":"W10","v":0},null,{"$f":"Y10","v":0},null,null,null,null,{"$f":"'Modelo 3'!E43","v":0}]
[null,null,null,"Sujeito Passivo A ",null,"Sujeito Passivo B",null,"Dependente 1 ",null,"Dependente 2 ",null,"Dependente 3",null,"Dependente 4",null,null,null,null,{"$f":"'Modelo 3'!F43","v":0}]
[null,"SOMA TOTAL→",null,{"$f":"D97","v":0},null,{"$f":"F97","v":0},null,{"$f":"H97","v":0},null,{"$f":"J97","v":0},null,{"$f":"L97","v":0},null,{"$f":"N97","v":0}]
[null,"Continente (DE)",null,"SOMA",null,{"$f":"SUM(D99:O99)","v":0},null,{"$f":"IF(S95=1,F100,)","v":0},null,null,"T. Separada"]
[null,"Açores ",null,"SOMA",null,{"$f":"IF(F100<0,0,F100)","v":0},null,{"$f":"IF(S95=2,F101,)","v":0},null,"SP A→",{"$f":"IF(S95>=4,0,SUM(D96+H96+J96+L96+N96))","v":0}]
[null,"Madeira",null,"SOMA",null,{"$f":"IF(F100<0,0,F100)","v":0},null,{"$f":"IF(S95=3,F102,)","v":0},null,"SP B→",{"$f":"IF(S95>=4,0,SUM(F96+H96+J96+L96+N96))","v":0}]
[null,{"$f":"IF(F100<0,0,SUM(H100+H101+H102))","v":0},null,"← Dedução Específica "]
[]
[null,"Art.º 27.º e 32.º-A do CIRS - Prémios de seguros no âmbito de profissões de desgaste rápido ",null,null,null,null,null,null,null,null,null,null,null,null,null,null,null,{"$f":"R46","v":1},{"$f":"IF(S106=TRUE,4,IF(S107=TRUE,4,IF(S108=TRUE,1,S46)))","v":1}]
[null,"T.  Separada →",null,{"$f":"IF(R105=1,D110,)","v":0},null,{"$f":"IF(R105=1,F110,)","v":0},null,{"$f":"IF(R105=1,H110/2,0)","v":0},null,{"$f":"IF(R105=1,J110/2,0)","v":0},null,{"$f":"IF(R105=1,L110/2,0)","v":0},null,{"$f":"IF(R105=1,N110/2,0)","v":0},null,null,null,null,{"$f":"'Modelo 3'!D43","v":0}]
[null,"Rendimento Bruto →",null,{"$f":"O13","v":0},null,{"$f":"Q13","v":0},null,{"$f":"S13","v":0},null,{"$f":"U13","v":0},null,{"$f":"W13","v":0},null,{"$f":"Y13","v":0},null,null,null,null,{"$f":"'Modelo 3'!E43","v":0}]
[null,"Limites →",null,5,null,{"$f":"'Modelo 3'!G36","v":428.9},null,{"$f":"D108*F108","v":2144.5},null,null,null,null,null,null,null,null,null,null,{"$f":"'Modelo 3'!F43","v":0}]
[null,null,null,"Sujeito Passivo A ",null,"Sujeito Passivo B",null,"Dependente 1 ",null,"Dependente 2 ",null,"Dependente 3",null,"Dependente 4"]
[null,"SOMA TOTAL→",null,{"$f":"IF(D107<H108,D107,IF(D107>=H108,H108,))","v":0},null,{"$f":"IF(F107<H108,F107,IF(F107>=H108,H108,))","v":0},null,{"$f":"IF(H107<H108,H107,IF(H107>=H108,H108,))","v":0},null,{"$f":"IF(J107<H108,J107,IF(J107>=H108,H108,))","v":0},null,{"$f":"IF(L107<H108,L107,IF(L107>=H108,H108,))","v":0},null,{"$f":"IF(N107<H108,N107,IF(N107>=H108,H108,))","v":0}]
[null,"Continente (DE)",null,"SOMA",null,{"$f":"SUM(D110:O110)","v":0},null,{"$f":"IF(S105=1,F111,)","v":0},null,null,"T. Separada"]
[null,"Açores ",null,"SOMA",null,{"$f":"IF(F111<0,0,F111)","v":0},null,{"$f":"IF(S105=2,F112,)","v":0},null,"SP A→",{"$f":"IF(S105>=4,0,SUM(D106+H106+J106+L106+N106))","v":0}]
[null,"Madeira",null,"SOMA",null,{"$f":"IF(F111<0,0,F111)","v":0},null,{"$f":"IF(S105=3,F113,)","v":0},null,"SP B→",{"$f":"IF(S105>=4,0,SUM(F106+H106+J106+L106+N106))","v":0}]
[null,{"$f":"IF(F111<0,0,SUM(H111+H112+H113))","v":0},null,"← Dedução Específica "]
[]
[null,"Lei n.º 21/85, art.º 17 al. i), Despesas de valorização profissional de juízes",null,null,null,null,null,null,null,null,null,null,null,null,null,null,null,{"$f":"R46","v":1},{"$f":"IF(S117=TRUE,4,IF(S118=TRUE,4,IF(S119=TRUE,1,S46)))","v":1}]
[null,"T.  Separada →",null,{"$f":"IF(R116=1,D121,0)","v":0},null,{"$f":"IF(R116=1,F121,0)","v":0},null,{"$f":"IF(R116=1,H121/2,0)","v":0},null,{"$f":"IF(R116=1,J121/2,0)","v":0},null,{"$f":"IF(R116=1,L121/2,0)","v":0},null,{"$f":"IF(R116=1,N121/2,0)","v":0},null,null,null,null,{"$f":"'Modelo 3'!D43","v":0}]
[null,"Rendimento Bruto →",null,{"$f":"O12","v":0},null,{"$f":"Q12","v":0},null,{"$f":"S12","v":0},null,{"$f":"U12","v":0},null,{"$f":"W12","v":0},null,{"$f":"Y12","v":0},null,null,null,null,{"$f":"'Modelo 3'!E43","v":0}]
[null,"Limites →",null,249.4,null,1,null,null,null,null,null,null,null,null,null,null,null,null,{"$f":"'Modelo 3'!F43","v":0}]
[null,null,null,"Sujeito Passivo A ",null,"Sujeito Passivo B",null,"Dependente 1 ",null,"Dependente 2 ",null,"Dependente 3",null,"Dependente 4"]
[null,"SOMA TOTAL→",null,{"$f":"IF(D118*F119<D119,D118*F119,D119)","v":0},null,{"$f":"IF(F118*F119<D119,F118*F119,D119)","v":0},null,{"$f":"IF(H118*F119<D119,H118*F119,D119)","v":0},null,{"$f":"IF(J118*F119<D119,J118*F119,D119)","v":0},null,{"$f":"IF(L118*F119<D119,L118*F119,D119)","v":0},null,{"$f":"IF(N118*F119<D119,N118*F119,D119)","v":0}]
[null,"Continente (DE)",null,"SOMA",null,{"$f":"SUM(D121:O121)","v":0},null,{"$f":"IF(S116=1,F122,)","v":0},null,null,"T. Separada"]
[null,"Açores ",null,"SOMA",null,{"$f":"IF(F122<0,0,F122)","v":0},null,{"$f":"IF(S116=2,F123,)","v":0},null,"SP A→",{"$f":"IF(S116>=4,0,SUM(D117+H117+J117+L117+N117))","v":0}]
[null,"Madeira",null,"SOMA",null,{"$f":"IF(F123<0,0,F123)","v":0},null,{"$f":"IF(S116=3,F124,)","v":0},null,"SP B→",{"$f":"IF(S116>=4,0,SUM(F117+H117+J117+L117+N117))","v":0}]
[null,{"$f":"IF(F122<0,0,SUM(H122+H123+H124))","v":0},null,"← Dedução Específica "]
[]
[null,"Art.º 2.º  do CIRS - Gratificações não atribuídas pela entidade patronal",null,null,null,null,null,null,null,null,null,null,null,null,null,null,null,{"$f":"R46","v":1},{"$f":"IF(S128=TRUE,4,IF(S129=TRUE,4,IF(S130=TRUE,1,S46)))","v":1}]
[null,"T.  Separada →",null,{"$f":"IF(R127=1,D133,0)","v":0},null,{"$f":"IF(R127=1,F133,0)","v":0},null,{"$f":"IF(R127=1,H133/2,0)","v":0},null,{"$f":"IF(R127=1,J133/2,0)","v":0},null,{"$f":"IF(R127=1,L133/2,0)","v":0},null,{"$f":"IF(R127=1,N133/2,0)","v":0},null,null,null,null,{"$f":"'Modelo 3'!D43","v":0}]
[null,"Grati. Bombeiros →",null,{"$f":"IF(O9>F131,F131*E131,IF(O9<=F131,O9*E131,))","v":0},null,{"$f":"IF(Q9>F131,F131*E131,IF(Q9<=F131,Q9*E131,))","v":0},null,{"$f":"IF(S9>F131,F131*E131,IF(S9<=F131,S9*E131,))","v":0},null,{"$f":"IF(U9>F131,F131*E131,IF(U9<=F131,U9*E131,))","v":0},null,{"$f":"IF(W9>F131,F131*E131,IF(W9<=F131,W9*E131,))","v":0},null,{"$f":"IF(Y9>F131,F131*E131,IF(Y9<=F131,Y9*E131,))","v":0},null,null,null,null,{"$f":"'Modelo 3'!E43","v":0}]
[null,"Rendimento Bruto →",null,{"$f":"O8*E131","v":0},null,{"$f":"Q8*E131","v":0},null,{"$f":"(S8*E131)","v":0},null,{"$f":"(U8*E131)","v":0},null,{"$f":"(W8*E131)","v":0},null,{"$f":"(Y8*E131)","v":0},null,null,null,null,{"$f":"'Modelo 3'!F43","v":0}]
[null,"Taxa →",null,null,{"$f":"'Modelo 3'!N36","v":0.1},{"$f":"'Modelo 3'!G36*3","v":1286.6999999999998},null,null,null,null,null,null,null,null,{"$f":"'Modelo 3'!S36","v":0.25}]
[null,null,null,"Sujeito Passivo A ",null,"Sujeito Passivo B",null,"Dependente 1 ",null,"Dependente 2 ",null,"Dependente 3",null,"Dependente 4"]
[null,"SOMA TOTAL→",null,{"$f":"SUM(D129:E130)","v":0},null,{"$f":"SUM(F129:G130)","v":0},null,{"$f":"SUM(H129:I130)","v":0},null,{"$f":"SUM(J129:K130)","v":0},null,{"$f":"SUM(L129:M130)","v":0},null,{"$f":"SUM(N129:O130)","v":0}]
[null,"Continente (TA)",null,"SOMA",null,{"$f":"SUM(D133:O133)","v":0},null,{"$f":"IF(S127=1,F134,)","v":0},null,null,"T. Separada",null,null,"Não  residentes"]
[null,"Açores ",null,"SOMA",null,{"$f":"IF(F134<0,0,F134)","v":0},null,{"$f":"IF(S127=2,F135,)","v":0},null,"SP A→",{"$f":"IF(S127>=4,0,SUM(D128+H128+J128+L128+N128))","v":0},null,"SP A→",{"$f":"IF(S127>=4,R135,)","v":0},null,{"$f":"SUM(S7+U7+W7+Y7/2)+O7","v":0},null,{"$f":"IF(S127>=4,P135*O131,)","v":0}]
[null,"Madeira",null,"SOMA",null,{"$f":"IF(F134<0,0,F134)","v":0},null,{"$f":"IF(S127=3,F136,)","v":0},null,"SP B→",{"$f":"IF(S127>=4,0,SUM(F128+H128+J128+L128+N128))","v":0},null,"SP B→",{"$f":"IF(S127>=4,R136,)","v":0},null,{"$f":"SUM(S7+U7+W7+Y7/2)+Q7","v":0},null,{"$f":"IF(S127>=4,P136*O131,)","v":0}]
[null,{"$f":"IF(F134<0,0,SUM(H134+H135+H136))","v":0},null,"← Tributação Autónoma"]
[]
[null,"Retenção na fonte  de IRS da categoria A",null,null,null,null,null,null,null,null,null,null,null,null,null,null,null,{"$f":"R46","v":1},{"$f":"IF(S140=TRUE,4,IF(S141=TRUE,4,IF(S142=TRUE,1,S46)))","v":1}]
[null,"T.  Separada →",null,{"$f":"IF(R139=1,D143,0)","v":0},null,{"$f":"IF(R139=1,F143,0)","v":0},null,{"$f":"IF(R139=1,H143/2,0)","v":0},null,{"$f":"IF(R139=1,J143/2,0)","v":0},null,{"$f":"IF(R139=1,L143/2,0)","v":0},null,{"$f":"IF(R139=1,N143/2,0)","v":0},null,null,null,null,{"$f":"'Modelo 3'!D43","v":0}]
[null,"Rendimento Bruto →",null,{"$f":"O15","v":0},null,{"$f":"Q15","v":0},null,{"$f":"S15","v":0},null,{"$f":"U15","v":0},null,{"$f":"W15","v":0},null,{"$f":"Y15","v":0},null,null,null,null,{"$f":"'Modelo 3'!E43","v":0}]
[null,null,null,"Sujeito Passivo A ",null,"Sujeito Passivo B",null,"Dependente 1 ",null,"Dependente 2 ",null,"Dependente 3",null,"Dependente 4",null,null,null,null,{"$f":"'Modelo 3'!F43","v":0}]
[null,"SOMA TOTAL→",null,{"$f":"D141","v":0},null,{"$f":"F141","v":0},null,{"$f":"H141","v":0},null,{"$f":"J141","v":0},null,{"$f":"L141","v":0},null,{"$f":"N141","v":0}]
[null,"Continente (RF)",null,"SOMA",null,{"$f":"SUM(D143:O143)","v":0},null,{"$f":"IF(S139=1,F144,)","v":0},null,null,"T. Separada",null,null,"Não  residentes"]
[null,"Açores ",null,"SOMA",null,{"$f":"IF(F144<0,0,F144)","v":0},null,{"$f":"IF(S139=2,F145,)","v":0},null,"SP A→",{"$f":"IF(S139>=4,0,SUM(D140+H140+J140+L140+N140))","v":0},null,"SP A→",{"$f":"IF(S127>=4,P145,)","v":0},null,{"$f":"SUM(D140+H140+J140+L140+N140)","v":0}]
[null,"Madeira",null,"SOMA",null,{"$f":"IF(F144<0,0,F144)","v":0},null,{"$f":"IF(S139=3,F146,)","v":0},null,"SP B→",{"$f":"IF(S139>=4,0,SUM(F140+H140+J140+L140+N140))","v":0},null,"SP B→",{"$f":"IF(S127>=4,P146,)","v":0},null,{"$f":"SUM(F140+H140+J140+L140+N140)","v":0}]
[null,{"$f":"IF(F144<0,0,SUM(H144+H145+H146))","v":0},null,"← Retenção na Fonte"]
[]
[null,"Art.º 56.º - A do CIRS - Sujeitos passivos com deficiência categoria A"]
[null,"Rendimento Bruto →",null,{"$f":"SUM(O7+'Anexo B'!Z16+T150)","v":0},null,{"$f":"SUM(Q7+'Anexo B'!AA16+T151)","v":0},null,{"$f":"SUM(S7+'Anexo B'!AB16)","v":0},null,{"$f":"SUM(U7+'Anexo B'!AC16)","v":0},null,{"$f":"SUM(W7)","v":0},null,{"$f":"SUM(Y7)","v":0},null,{"$f":"'Modelo 3'!J20+'Modelo 3'!J21+'Modelo 3'!J22+'Modelo 3'!J23+'Modelo 3'!K20+'Modelo 3'!K21+'Modelo 3'!K22+'Modelo 3'!K23","v":0},null,null,null,{"$f":"'Anexo J'!L7","v":0}]
[null,"Taxa →",null,0.15,{"$f":"'Modelo 3'!H20+'Modelo 3'!H21+'Modelo 3'!H22+'Modelo 3'!H23","v":0},null,{"$f":"'Modelo 3'!I20+'Modelo 3'!I21+'Modelo 3'!I22+'Modelo 3'!I23","v":0},null,{"$f":"IF(C41=2,0,IF(C41=3,SUM(P150)))","v":0},null,{"$f":"IF(F41=2,0,IF(F41=3,SUM(P150)))","v":0},null,{"$f":"IF(I41=2,0,IF(I41=3,SUM(P150)))","v":0},null,{"$f":"IF(L41=2,0,IF(L41=3,SUM(P150)))","v":0},null,null,null,null,{"$f":"'Anexo J'!N7","v":0}]
[null,"Limites →",null,2500]
[null,null,null,"Sujeito Passivo A ",null,"Sujeito Passivo B",null,"Dependente 1 ",null,"Dependente 2 ",null,"Dependente 3",null,"Dependente 4"]
[null,"SOMA TOTAL →",null,{"$f":"IF(E151=0,0,IF(D155>D152,D152,D150*D151))","v":0},null,{"$f":"IF(G151=0,0,IF(F155>D152,D152,F150*D151))","v":0},null,{"$f":"IF(I151=0,0,IF(H155>D152,D152,H150*D151))","v":0},null,{"$f":"IF(K151=0,0,IF(J155>D152,D152,J150*D151))","v":0},null,{"$f":"IF(M151=0,0,IF(L155>D152,D152,L150*D151))","v":0},null,{"$f":"IF(O151=0,0,IF(N155>D152,D152,N150*D151))","v":0}]
[null,null,null,{"$f":"D150*D151","v":0},null,{"$f":"F150*D151","v":0},null,{"$f":"H150*D151","v":0},null,{"$f":"J150*D151","v":0},null,{"$f":"L150*D151","v":0},null,{"$f":"N150*D151","v":0}]
[]
[null," Art.º 74.º do CIRS - Rendimentos produzidos em anos anteriores Cat. A",null,null,null,null,null,null,null,null,null,null,{"$f":"Artigos!F51","v":0}]
[null,"T.  Separada →",null,{"$f":"IF(X158=1,D160,0)","v":0},null,{"$f":"IF(X158=1,J160+L160,0)","v":0},null,{"$f":"IF(X158=1,D161,0)","v":0},null,{"$f":"IF(X158=1,J161+L161,0)","v":0},null,null,{"$f":"Artigos!F69","v":0},null,null,null,null,null,null,null,null,null,null,{"$f":"R46","v":1},{"$f":"IF(Z162=TRUE,4,IF(Z163=TRUE,4,IF(Z164=TRUE,1,S46)))","v":1}]
[null,"Nº de Anos →",null,null,{"$f":"O18+1","v":1},null,{"$f":"Q18+1","v":1},null,null,null,null,null,null,"Rendimento Bruto",null,"Dedução Específica",null,"Rendimento Coletável",null,"Rendi. Anos Anteriores",null,"TAXA","Parcela a Abater",null,{"$f":"D160*H160","v":0}]
[null,"Sujeito Passivo A  →",null,{"$f":"IF(N160<1,0,(T160*R160)/N160*(E159-1)/E159)","v":0},null,{"$f":"(R160-D160+0)","v":0},null,{"$f":"(F160*V160)-W160","v":0},null,{"$f":"IF(X158=1,0,IF(N160<1,0,IF(R160<1,0,(H160*D160)/F160)))","v":0},null,{"$f":"IF(Y159<=0,0,IF(X158=0,0,Y159/M157))","v":0},null,{"$f":"IF(Y158=4,0,D49)","v":0},null,{"$f":"D66+D77+D89+D99+D110+D121","v":0},null,{"$f":"IF(Y158=4,0,IF(N160>P160,N160-P160,0))","v":0},null,{"$f":"O17","v":0},null,{"$f":"IF(X158=0,Artigos!B32,IF(X158=1,Artigos!B50,0))","v":0},{"$f":"IF(X158=0,Artigos!B33,IF(X158=1,Artigos!B51,0))","v":0},null,{"$f":"D161*H161","v":0}]
[null,"Sujeito Passivo B  →",null,{"$f":"IF(N161<1,0,(T161*R161)/N161*(G159-1)/G159)","v":0},null,{"$f":"(R161-D161+0)","v":0},null,{"$f":"(F161*V161)-W161","v":0},null,{"$f":"IF(X158=1,0,IF(N161<1,0,IF(R161<1,0,(H161*D161)/F161)))","v":0},null,{"$f":"IF(Y160<=0,0,IF(X158=0,0,Y160/M158))","v":0},null,{"$f":"IF(Y158=4,0,F49)","v":0},null,{"$f":"F66+F77+F89+F99+F110+F121","v":0},null,{"$f":"IF(Y158=4,0,IF(N161>P161,N161-P161,0))","v":0},null,{"$f":"Q17","v":0},null,{"$f":"IF(X158=0,Artigos!B68,IF(X158=1,Artigos!B68,0))","v":0},{"$f":"IF(X158=0,Artigos!B69,IF(X158=1,Artigos!B69,0))","v":0}]
[null,"SOMA TOTAL →",null,{"$f":"SUM(D160:E161)","v":0},null,null,null,null,null,null,null,{"$f":"SUM(J160:M161)","v":0},null,null,null,null,null,null,null,null,null,null,null,null,null,{"$f":"'Modelo 3'!D43","v":0}]
[null,"Continente ",null,"SOMA",{"$f":"SUM(D162)","v":0},null,{"$f":"IF(Y158=1,E163,)","v":0},null,{"$f":"SUM(L162)","v":0},null,{"$f":"IF(Y158=1,I163,)","v":0},null,null,"T. Separado",null,null,"T. Separado",null,null,null,null,null,null,null,null,{"$f":"'Modelo 3'!E43","v":0}]
[null,"Açores ",null,"SOMA",{"$f":"IF(E163<0,0,E163)","v":0},null,{"$f":"IF(Y158=2,E164,)","v":0},null,{"$f":"IF(I163<0,0,I163)","v":0},null,{"$f":"IF(Y158=2,I164,)","v":0},null,"SP A→",{"$f":"SUM(D158)","v":0},null,"SP B→",{"$f":"SUM(H158)","v":0},null,"← Quociente dos rendimentos de anos anteriores",null,null,null,null,null,null,{"$f":"'Modelo 3'!F43","v":0}]
[null,"Madeira",null,"SOMA",{"$f":"IF(E163<0,0,E163)","v":0},null,{"$f":"IF(Y158=3,E165,)","v":0},null,{"$f":"IF(I163<0,0,I163)","v":0},null,{"$f":"IF(Y158=3,I165,)","v":0},null,"SP A→",{"$f":"SUM(F158)","v":0},null,"SP B→",{"$f":"SUM(J158)","v":0},null,"← Imposto correspondente a rendimentos de anos anteriores"]
[null,{"$f":"IF(E163<0,0,SUM(G163:H165))","v":0},null,"← Quociente dos rendimentos de anos anteriores"]
[null,{"$f":"IF(I163<0,0,SUM(K163:L165))","v":0},null,"← Imposto correspondente a rendimentos de anos anteriores"]
[]
[null,"CATEGORIA H"]
[null,"Art.º 11.º do CIRS - Rendimentos da categoria H  + Pensões de sobrevivência",null,null,null,null,null,null,null,null,null,null,null,null,null,null,null,{"$f":"R46","v":1},{"$f":"IF(S171=TRUE,4,IF(S172=TRUE,4,IF(S173=TRUE,1,S46)))","v":1}]
[null,"T.  Separada →",null,{"$f":"IF(R170=1,D174,0)","v":0},null,{"$f":"IF(R170=1,F174,0)","v":0},null,{"$f":"IF(R170=1,H174/2,0)","v":0},null,{"$f":"IF(R170=1,J174/2,0)","v":0},null,{"$f":"IF(R170=1,L174/2,0)","v":0},null,{"$f":"IF(R170=1,N174/2,0)","v":0},null,null,null,null,{"$f":"'Modelo 3'!D43","v":0}]
[null,"Rendimento Bruto →",null,{"$f":"(O22+O23+'Anexo J'!L13)-D249","v":0},null,{"$f":"(Q22+Q23+'Anexo J'!N13)-F249","v":0},null,{"$f":"(S22+S23)-H249","v":0},null,{"$f":"(U22+U23)-J249","v":0},null,{"$f":"(W22+W23)-L249","v":0},null,{"$f":"(Y22+Y23)-N249","v":0},null,null,null,null,{"$f":"'Modelo 3'!E43","v":0}]
[null,null,null,"Sujeito Passivo A ",null,"Sujeito Passivo B",null,"Dependente 1 ",null,"Dependente 2 ",null,"Dependente 3",null,"Dependente 4",null,null,null,null,{"$f":"'Modelo 3'!F43","v":0}]
[null,"SOMA TOTAL→",null,{"$f":"D172","v":0},null,{"$f":"F172","v":0},null,{"$f":"H172","v":0},null,{"$f":"J172","v":0},null,{"$f":"L172","v":0},null,{"$f":"N172","v":0}]
[null,"Continente (RB)",null,"SOMA",{"$f":"SUM(D174:O174)","v":0},null,{"$f":"IF(S170=1,E175,)","v":0},null,null,"T. Separado"]
[null,"Açores ",null,"SOMA",{"$f":"IF(E175<0,0,E175)","v":0},null,{"$f":"IF(S170=2,E176,)","v":0},null,"SP A→",{"$f":"IF(S170>=4,0,SUM(D171+H171+J171+L171+N171))","v":0}]
[null,"Madeira",null,"SOMA",{"$f":"IF(E175<0,0,E175)","v":0},null,{"$f":"IF(S170=3,E177,)","v":0},null,"SP B→",{"$f":"IF(S170>=4,0,SUM(F171+H171+J171+L171+N171))","v":0}]
[null,{"$f":"IF(E175<0,0,SUM(G175+G176+G177))","v":0},null,"← Rendimento Bruto"]
[]
[null,"Art.º 11.º do CIRS - Pensões de alimentos (Quem recebe) ",null,null,null,null,null,null,null,null,null,null,null,null,null,{"$f":"IF(AA42<=2,0,IF(AA42=3,AA42,))","v":0},null,{"$f":"R46","v":1},{"$f":"IF(S181=TRUE,4,IF(S182=TRUE,4,IF(S183=TRUE,1,S46)))","v":1}]
[null,"T.  Separada →",null,{"$f":"IF(R180=1,D184,0)","v":0},null,{"$f":"IF(R180=1,F184,0)","v":0},null,{"$f":"IF(R180=1,H184/2,0)","v":0},null,{"$f":"IF(R180=1,J184/2,0)","v":0},null,{"$f":"IF(R180=1,L184/2,0)","v":0},null,{"$f":"IF(R180=1,N184/2,0)","v":0},null,null,null,null,{"$f":"'Modelo 3'!D43","v":0}]
[null,"Rendimento Bruto →",null,{"$f":"O24","v":0},null,{"$f":"Q24","v":0},null,{"$f":"S24","v":0},null,{"$f":"U24","v":0},null,{"$f":"W24","v":0},null,{"$f":"Y24","v":0},null,null,null,null,{"$f":"'Modelo 3'!E43","v":0}]
[null,null,null,"Sujeito Passivo A ",null,"Sujeito Passivo B",null,"Dependente 1 ",null,"Dependente 2 ",null,"Dependente 3",null,"Dependente 4",null,null,null,null,{"$f":"'Modelo 3'!F43","v":0}]
[null,"SOMA TOTAL→",null,{"$f":"IF(P180=3,0,IF(P180<=2,D182))","v":0},null,{"$f":"IF(P180=3,0,IF(P180<=2,F182))","v":0},null,{"$f":"IF(P180=3,0,IF(P180<=2,H182))","v":0},null,{"$f":"IF(P180=3,0,IF(P180<=2,J182))","v":0},null,{"$f":"IF(P180=3,0,IF(P180<=2,L182))","v":0},null,{"$f":"IF(P180=3,0,IF(P180<=2,N182))","v":0}]
[null,"Continente (RB)",null,"SOMA",{"$f":"SUM(D184:O184)","v":0},null,{"$f":"IF(S180=1,E185,)","v":0},null,null,"T. Separado"]
[null,"Açores ",null,"SOMA",{"$f":"IF(E185<0,0,E185)","v":0},null,{"$f":"IF(S180=2,E186,)","v":0},null,"SP A→",{"$f":"IF(S180>=4,0,SUM(D181+H181+J181+L181+N181))","v":0}]
[null,"Madeira",null,"SOMA",{"$f":"IF(E185<0,0,E185)","v":0},null,{"$f":"IF(S180=3,E187,)","v":0},null,"SP B→",{"$f":"IF(S180>=4,0,SUM(F181+H181+J181+L181+N181))","v":0}]
[null,{"$f":"IF(E185<0,0,SUM(G185+G186+G187))","v":0},null,"← Rendimento Bruto"]
[]
[null,"Art.º 54.º do CIRS - Rendas temporárias e vitalícias.",null,null,null,null,null,null,null,null,null,null,null,null,null,null,null,{"$f":"R46","v":1},{"$f":"IF(S191=TRUE,4,IF(S192=TRUE,4,IF(S193=TRUE,1,S46)))","v":1}]
[null,"T.  Separada →",null,{"$f":"IF(R190=1,D194,0)","v":0},null,{"$f":"IF(R190=1,F194,0)","v":0},null,{"$f":"IF(R190=1,H194/2,0)","v":0},null,{"$f":"IF(R190=1,J194/2,0)","v":0},null,{"$f":"IF(R190=1,L194/2,0)","v":0},null,{"$f":"IF(R190=1,N194/2,0)","v":0},null,null,null,null,{"$f":"'Modelo 3'!D43","v":0}]
[null,"Rendimento Bruto →",null,{"$f":"O26","v":0},null,{"$f":"Q26","v":0},null,{"$f":"S26","v":0},null,{"$f":"U26","v":0},null,{"$f":"W26","v":0},null,{"$f":"Y26","v":0},null,null,null,null,{"$f":"'Modelo 3'!E43","v":0}]
[null,null,null,"Sujeito Passivo A ",null,"Sujeito Passivo B",null,"Dependente 1 ",null,"Dependente 2 ",null,"Dependente 3",null,"Dependente 4",null,null,null,null,{"$f":"'Modelo 3'!F43","v":0}]
[null,"SOMA TOTAL→",null,{"$f":"D192","v":0},null,{"$f":"F192","v":0},null,{"$f":"H192","v":0},null,{"$f":"J192","v":0},null,{"$f":"L192","v":0},null,{"$f":"N192","v":0}]
[null,"Continente (RB)",null,"SOMA",{"$f":"SUM(D194:O194)","v":0},null,{"$f":"IF(S190=1,E195,)","v":0},null,null,"T. Separado"]
[null,"Açores ",null,"SOMA",{"$f":"IF(E195<0,0,E195)","v":0},null,{"$f":"IF(S190=2,E196,)","v":0},null,"SP A→",{"$f":"IF(S190>=4,0,SUM(D191+H191+J191+L191+N191))","v":0}]
[null,"Madeira",null,"SOMA",{"$f":"IF(E195<0,0,E195)","v":0},null,{"$f":"IF(S190=3,E197,)","v":0},null,"SP B→",{"$f":"IF(S190>=4,0,SUM(F191+H191+J191+L191+N191))","v":0}]
[null,{"$f":"IF(E195<0,0,SUM(G195+G196+G197))","v":0},null,"← Rendimento Bruto"]
[]
[null,"Art.º 11.º do CIRS - Pensões de alimentos  Opção pela tributação autónoma (Quem recebe) ",null,null,null,null,null,null,null,null,null,null,null,{"$f":"IF(P200<=2,0,'Modelo 3'!O36)","v":0},{"$f":"'Modelo 3'!S36","v":0.25},{"$f":"IF(AA42=3,AA42,)","v":0},{"$f":"'Modelo 3'!J36","v":4104},{"$f":"R46","v":1},{"$f":"IF(T200=TRUE,4,IF(T201=TRUE,4,IF(T202=TRUE,1,S46)))","v":1},{"$f":"'Modelo 3'!D43","v":0}]
[null,"T.  Separada →",null,{"$f":"IF(R200=1,D205,0)","v":0},null,{"$f":"IF(R200=1,F205,0)","v":0},null,{"$f":"IF(R200=1,H205/2,0)","v":0},null,{"$f":"IF(R200=1,J205/2,0)","v":0},null,{"$f":"IF(R200=1,L205/2,0)","v":0},null,{"$f":"IF(R200=1,N205/2,0)","v":0},null,{"$f":"IF(O22+O23>=1,1,)","v":0},{"$f":"IF(P201=1,0,N200*(D202-D203))","v":0},{"$f":"IF(V211>=1,(O24-V211)*N200,)","v":0},{"$f":"IF('Modelo 3'!E52=2,(Q201)*N200,)","v":0},{"$f":"'Modelo 3'!E43","v":0}]
[null,"Rendimento Bruto →",null,{"$f":"IF(Q211>=1,O24-V211,IF(Q211=0,O24,0))","v":0},null,{"$f":"IF(Q212>=1,Q24-V212,IF(Q212=0,Q24,0))","v":0},null,{"$f":"IF(Q213>=1,S24-V213,IF(Q213=0,S24,0))","v":0},null,{"$f":"IF(Q214>=1,U24-V214,IF(Q214=0,U24,0))","v":0},null,{"$f":"IF(Q215>=1,W24-V215,IF(Q215=0,W24,0))","v":0},null,{"$f":"IF(Q216>=1,Y24-V216,IF(Q216=0,Y24,0))","v":0},null,{"$f":"IF(Q22+Q23>=1,1,)","v":0},{"$f":"IF(P202=1,0,N200*(F202-F203))","v":0},{"$f":"IF(V212>=1,(Q24-V212)*N200,)","v":0},{"$f":"IF('Modelo 3'!E52=2,(Q202)*N200,)","v":0},{"$f":"'Modelo 3'!F43","v":0}]
[null,"Limites →",null,{"$f":"IF(R211>=1,U211,IF(D202<D214,D202,D214))*0","v":0},null,{"$f":"IF(R212>=1,U212,IF(F202<F214,F202,F214))*0","v":0},null,{"$f":"IF(R213>=1,U213,IF(H202<H214,H202,H214))*0","v":0},null,{"$f":"IF(R214>=1,U214,IF(J202<J214,J202,J214))*0","v":0},null,{"$f":"IF(R215>=1,U215,IF(L202<L214,L202,L214))*0","v":0},null,{"$f":"IF(R216>=1,U216,IF(N202<N214,N202,N214))*0","v":0},null,{"$f":"IF(S22+S23>=1,1,)","v":0},{"$f":"IF(P203=1,0,N200*(H202-H203))","v":0},{"$f":"IF(V213>=1,(S24-V213)*N200,)","v":0},{"$f":"IF('Modelo 3'!E52=2,(Q203)*N200,)","v":0}]
[null,null,null,"Sujeito Passivo A ",null,"Sujeito Passivo B",null,"Dependente 1 ",null,"Dependente 2 ",null,"Dependente 3",null,"Dependente 4",null,{"$f":"IF(U22+U23>=1,1,)","v":0},{"$f":"IF(P204=1,0,N200*(J202-J203))","v":0},{"$f":"IF(V214>=1,(U24-V214)*N200,)","v":0},{"$f":"IF('Modelo 3'!E52=2,(Q204)*N200,)","v":0}]
[null,"SOMA TOTAL→",null,{"$f":"SUM(Q201:R201)-S201","v":0},null,{"$f":"SUM(Q202:R202)-S202","v":0},null,{"$f":"SUM(Q203:R203)-S203","v":0},null,{"$f":"SUM(Q204:R204)-S204","v":0},null,{"$f":"SUM(Q205:R205)-S205","v":0},null,{"$f":"SUM(Q206:R206)-S206","v":0},null,{"$f":"IF(W22+W23>=1,1,)","v":0},{"$f":"IF(P205=1,0,N200*(L202-L203))","v":0},{"$f":"IF(V215>=1,(W24-V215)*N200,)","v":0},{"$f":"IF('Modelo 3'!E52=2,(Q205)*N200,)","v":0}]
[null,"Continente (RB)",null,"SOMA",{"$f":"SUM(D205:O205)","v":0},null,{"$f":"IF(S200=1,E206,)","v":0},null,null,"T. Separado",null,null,"Não  residentes",null,null,{"$f":"IF(Y22+Y23>=1,1,)","v":0},{"$f":"IF(P206=1,0,N200*(N202-N203))","v":0},{"$f":"IF(V216>=1,(Y24-V216)*N200,)","v":0},{"$f":"IF('Modelo 3'!E52=2,(Q206)*N200,)","v":0}]
[null,"Açores ",null,"SOMA",{"$f":"IF(E206<0,0,E206)","v":0},null,{"$f":"IF(S190=2,E207,)","v":0},null,"SP A→",{"$f":"IF(S200>=4,0,SUM(D201+H201+J201+L201+N201))","v":0},null,"SP A→",{"$f":"IF(S200>=4,P207,)","v":0},null,{"$f":"SUM(O22+O23+O24+O26)+Q207","v":0},{"$f":"O207*O200","v":0},{"$f":"SUM(S22+S23+S24+S26+U22+U23+U24+U26+W22+W23+W24+W26+Y22+Y23+Y24+Y26)/2","v":0}]
[null,"Madeira",null,"SOMA",{"$f":"IF(E206<0,0,E206)","v":0},null,{"$f":"IF(S200=3,E208,)","v":0},null,"SP B→",{"$f":"IF(S200>=4,0,SUM(F201+H201+J201+L201+N201))","v":0},null,"SP B→",{"$f":"IF(S200>=4,P208,)","v":0},null,{"$f":"SUM(Q22+Q23+Q24+Q26)+Q207","v":0},{"$f":"O208*O200","v":0}]
[null,{"$f":"IF(E206<0,0,SUM(G206+G207+G208))","v":0},null,"← Tributação Autónoma"]
[]
[null,"Art.º 53.º do CIRS - Deduções específicas Categoria  H - Pensões + Segurança Social",null,null,null,null,null,null,null,null,null,null,null,{"$f":"R46","v":1},{"$f":"IF(W211=TRUE,4,IF(W212=TRUE,4,IF(W213=TRUE,1,S46)))","v":1},{"$f":"IF( AA42=3,O22+O23,)","v":0},{"$f":"IF(P211=0,0,IF(AA42=3,O24,))","v":0},{"$f":"P211+Q211","v":0},{"$f":"IFERROR(P211/R211,0)","v":0},{"$f":"IFERROR(Q211/R211,0)","v":0},{"$f":"D214*S211","v":0},{"$f":"D214*T211","v":0},{"$f":"'Modelo 3'!D43","v":0}]
[null,"T.  Separada →",null,{"$f":"IF(N211=1,D216,0)","v":0},null,{"$f":"IF(N211=1,F216,0)","v":0},null,{"$f":"IF(N211=1,H216/2,0)","v":0},null,{"$f":"IF(N211=1,J216/2,0)","v":0},null,{"$f":"IF(N211=1,L216/2,0)","v":0},null,{"$f":"IF(N211=1,N216/2,0)","v":0},null,{"$f":"IF( AA42=3,Q22+Q23,)","v":0},{"$f":"IF(P212=0,0,IF(AA42=3,Q24,))","v":0},{"$f":"P212+Q212","v":0},{"$f":"IFERROR(P212/R212,0)","v":0},{"$f":"IFERROR(Q212/R212,0)","v":0},{"$f":"F214*S212","v":0},{"$f":"F214*T212","v":0},{"$f":"'Modelo 3'!E43","v":0}]
[null,"Rendimento Bruto →",null,{"$f":"IF(P211+Q211>=1,0,D172+D184)","v":0},null,{"$f":"IF(P212+Q212>=1,0,F172+F184)","v":0},null,{"$f":"IF(P213+Q213>=1,0,H172+H184)","v":0},null,{"$f":"IF(P214+Q214>=1,0,J172+J184)","v":0},null,{"$f":"IF(P215+Q215>=1,0,L172+L184)","v":0},null,{"$f":"IF(P216+Q216>=1,0,N172+N184)","v":0},null,{"$f":"IF( AA42=3,S22+S23,)","v":0},{"$f":"IF(P213=0,0,IF(AA42=3,S24,))","v":0},0,{"$f":"IFERROR(P213/R213,0)","v":0},0,{"$f":"H214*S213","v":0},{"$f":"H214*T213","v":0},{"$f":"'Modelo 3'!F43","v":0}]
[null,"Limites →",null,{"$f":"IF(O29>=Q200,O29,Q200)","v":4104},null,{"$f":"IF(Q29>=Q200,Q29,Q200)","v":4104},null,{"$f":"IF(Q29>=Q200,Q29,Q200)","v":4104},null,{"$f":"IF(Q29>=Q200,Q29,Q200)","v":4104},null,{"$f":"IF(Q29>=Q200,Q29,Q200)","v":4104},null,{"$f":"IF(Q29>=Q200,Q29,Q200)","v":4104},null,{"$f":"IF( AA42=3,U22+U23,)","v":0},{"$f":"IF(P214=0,0,IF(AA42=3,U24,))","v":0},0,0,0,{"$f":"J214*S214","v":0},{"$f":"J214*T214","v":0}]
[null,null,null,"Sujeito Passivo A ",null,"Sujeito Passivo B",null,"Dependente 1 ",null,"Dependente 2 ",null,"Dependente 3",null,"Dependente 4",null,{"$f":"IF( AA42=3,W22+W23,)","v":0},{"$f":"IF(P215=0,0,IF(AA42=3,W24,))","v":0},0,0,0,{"$f":"L214*S215","v":0},{"$f":"L214*T215","v":0}]
[null,"SOMA TOTAL→",null,{"$f":"IF(R211>=1,U211,IF(D213<D214,D213,D214))","v":0},null,{"$f":"IF(R212>=1,U212,IF(F213<F214,F213,F214))","v":0},null,{"$f":"IF(R213>=1,U213,IF(H213<H214,H213,H214))","v":0},null,{"$f":"IF(R214>=1,U214,IF(J213<J214,J213,J214))","v":0},null,{"$f":"IF(R215>=1,U215,IF(L213<L214,L213,L214))","v":0},null,{"$f":"IF(R216>=1,U216,IF(N213<N214,N213,N214))","v":0},null,{"$f":"IF( AA42=3,Y22+Y23,)","v":0},{"$f":"IF(P216=0,0,IF(AA42=3,Y24,))","v":0},0,0,0,{"$f":"N214*S216","v":0},{"$f":"N214*T216","v":0}]
[null,"Continente (DE)",null,"SOMA",{"$f":"SUM(D216:O216)","v":0},null,{"$f":"IF(O211=1,E217,)","v":0},null,null,"T. Separado",null,null,null,null,null,"Pensões de alimentos",null,null,"Dedução Proporcional"]
[null,"Açores ",null,"SOMA",{"$f":"IF(E217<0,0,E217)","v":0},null,{"$f":"IF(O211=2,E218,)","v":0},null,"SP A→",{"$f":"IF(O211>=5,0,SUM(D212+H212+J212+L212))","v":0}]
[null,"Madeira",null,"SOMA",{"$f":"IF(E217<0,0,E217)","v":0},null,{"$f":"IF(O211=3,E219,)","v":0},null,"SP B→",{"$f":"IF(O211>=5,0,SUM(F212+H212+J212+L212))","v":0}]
[null,{"$f":"IF(E217<0,0,SUM(G217+G218+G219))","v":0},null,"← Dedução Específica "]
[]
[null,"Art.º 25.º do CIRS - Quotizações Sindicais  Cat. H",null,null,null,null,null,null,null,null,null,null,null,null,null,null,null,{"$f":"R46","v":1},{"$f":"IF(S223=TRUE,4,IF(S224=TRUE,4,IF(S225=TRUE,1,S46)))","v":1}]
[null,"T.  Separada →",null,{"$f":"IF(R222=1,D228,0)","v":0},null,{"$f":"IF(R222=1,F228,0)","v":0},null,{"$f":"IF(R222=1,H228/2,0)","v":0},null,{"$f":"IF(R222=1,J228/2,0)","v":0},null,{"$f":"IF(R222=1,L228/2,0)","v":0},null,{"$f":"IF(R222=1,N228/2,0)","v":0},null,null,null,null,{"$f":"'Modelo 3'!D43","v":0}]
[null,"Quot. Sindicais →",null,{"$f":"O27","v":0},null,{"$f":"Q27","v":0},null,{"$f":"S27","v":0},null,{"$f":"U27","v":0},null,{"$f":"W27","v":0},null,{"$f":"Y27","v":0},null,null,null,null,{"$f":"'Modelo 3'!E43","v":0}]
[null,"Rendimento Bruto →",null,{"$f":"D172+D184","v":0},null,{"$f":"F172+F184","v":0},null,{"$f":"H172+H184","v":0},null,{"$f":"J172+J184","v":0},null,{"$f":"L172+L184","v":0},null,{"$f":"N172+N184","v":0},null,null,null,null,{"$f":"'Modelo 3'!F43","v":0}]
[null,"Taxa →",null,0.01,null,1.5]
[null,null,null,"Sujeito Passivo A ",null,"Sujeito Passivo B",null,"Dependente 1 ",null,"Dependente 2 ",null,"Dependente 3",null,"Dependente 4"]
[null,"SOMA TOTAL→",null,{"$f":"IF(D224>D225*D226,(D225*D226)*F226,D224*F226)","v":0},null,{"$f":"IF(F224>F225*D226,(F225*D226)*F226,F224*F226)","v":0},null,{"$f":"IF(H224>H225*D226,(H225*D226)*F226,H224*F226)","v":0},null,{"$f":"IF(J224>J225*D226,(J225*D226)*F226,J224*F226)","v":0},null,{"$f":"IF(L224>L225*D226,(L225*D226)*F226,L224*F226)","v":0},null,{"$f":"IF(N224>N225*D226,(N225*D226)*F226,N224*F226)","v":0}]
[null,"Continente (DE)",null,"SOMA",{"$f":"SUM(D228:O228)","v":0},null,{"$f":"IF(S222=1,E229,)","v":0},null,null,"T. Separado"]
[null,"Açores ",null,"SOMA",{"$f":"IF(E229<0,0,E229)","v":0},null,{"$f":"IF(S222=2,E230,)","v":0},null,"SP A→",{"$f":"IF(S222>=4,0,SUM(D223+H223+J223+L223+N223))","v":0}]
[null,"Madeira",null,"SOMA",{"$f":"IF(E229<0,0,E229)","v":0},null,{"$f":"IF(S222=3,E231,)","v":0},null,"SP B→",{"$f":"IF(S222>=4,0,SUM(F223+H223+J223+L223+N223))","v":0}]
[null,{"$f":"IF(E229<0,0,SUM(G229+G230+G231))","v":0},null,"← Dedução Específica "]
[]
[null," Retenção na fonte da Categoria Cat. H.",null,null,null,null,null,null,null,null,null,null,null,null,null,null,null,{"$f":"R46","v":1},{"$f":"IF(S235=TRUE,4,IF(S236=TRUE,4,IF(S237=TRUE,1,S46)))","v":1}]
[null,"T.  Separada →",null,{"$f":"IF(R234=1,D238,0)","v":0},null,{"$f":"IF(R234=1,F238,0)","v":0},null,{"$f":"IF(R234=1,H238/2,0)","v":0},null,{"$f":"IF(R234=1,J238/2,0)","v":0},null,{"$f":"IF(R234=1,L238/2,0)","v":0},null,{"$f":"IF(R234=1,N238/2,0)","v":0},null,null,null,null,{"$f":"'Modelo 3'!D43","v":0}]
[null,"Rendimento Bruto →",null,{"$f":"O28","v":0},null,{"$f":"Q28","v":0},null,{"$f":"S28","v":0},null,{"$f":"U28","v":0},null,{"$f":"W28","v":0},null,{"$f":"Y28","v":0},null,null,null,null,{"$f":"'Modelo 3'!E43","v":0}]
[null,null,null,"Sujeito Passivo A ",null,"Sujeito Passivo B",null,"Dependente 1 ",null,"Dependente 2 ",null,"Dependente 3",null,"Dependente 4",null,null,null,null,{"$f":"'Modelo 3'!F43","v":0}]
[null,"SOMA TOTAL→",null,{"$f":"D236","v":0},null,{"$f":"F236","v":0},null,{"$f":"H236","v":0},null,{"$f":"J236","v":0},null,{"$f":"L236","v":0},null,{"$f":"N236","v":0}]
[null,"Continente (DE)",null,"SOMA",{"$f":"SUM(D238:O238)","v":0},null,{"$f":"IF(S234=1,E239,)","v":0},null,null,"T. Separado"]
[null,"Açores ",null,"SOMA",{"$f":"IF(E239<0,0,E239)","v":0},null,{"$f":"IF(S234=2,E240,)","v":0},null,"SP A→",{"$f":"IF(S234>=4,0,SUM(D235+H235+J235+L235+N235))","v":0},null,null,null,{"$f":"IF(S127>=4,P240,)","v":0},null,{"$f":"SUM(D235+H235+J235+L235+N235)","v":0}]
[null,"Madeira",null,"SOMA",{"$f":"IF(E239<0,0,E239)","v":0},null,{"$f":"IF(S234=3,E241,)","v":0},null,"SP B→",{"$f":"IF(S234>=4,0,SUM(F235+H235+J235+L235+N235))","v":0},null,null,null,{"$f":"IF(S127>=4,P241,)","v":0},null,{"$f":"SUM(F235+H235+J235+L235+N235)","v":0}]
[null,{"$f":"IF(E239<0,0,SUM(G239+G240+G241))","v":0},null,"← Retenção na Fonte"]
[]
[null,"Art.º 56.º - A do CIRS - Sujeitos passivos com deficiência Categoria H",null,null,null,null,null,null,null,null,null,null,null,null,null,null,null,null,null,{"$f":"'Anexo J'!L13","v":0}]
[null,"Rendimento Bruto →",null,{"$f":"O22+O23+T244","v":0},null,{"$f":"Q22+Q23+T245","v":0},null,{"$f":"S22+S23","v":0},null,{"$f":"U22+U23","v":0},null,{"$f":"W22+W23","v":0},null,{"$f":"Y22+Y23","v":0},null,{"$f":"'Modelo 3'!J20+'Modelo 3'!J21+'Modelo 3'!J22+'Modelo 3'!J23+'Modelo 3'!K20+'Modelo 3'!K21+'Modelo 3'!K22+'Modelo 3'!K23","v":0},null,null,null,{"$f":"'Anexo J'!N13","v":0}]
[null,"Taxa →",null,0.1]
[null,"Limites →",null,2500,{"$f":"'Modelo 3'!H20+'Modelo 3'!H21+'Modelo 3'!H22+'Modelo 3'!H23","v":0},null,{"$f":"'Modelo 3'!I20+'Modelo 3'!I21+'Modelo 3'!I22+'Modelo 3'!I23","v":0},null,{"$f":"IF(O41=2,0,IF(O41=3,SUM(P245)))","v":0},null,{"$f":"IF(R41=2,0,IF(R41=3,SUM(P245)))","v":0},null,{"$f":"IF(U41=2,0,IF(U41=3,SUM(P245)))","v":0},null,{"$f":"IF(X41=2,0,IF(X41=3,SUM(P245)))","v":0}]
[null,null,null,"Sujeito Passivo A ",null,"Sujeito Passivo B",null,"Dependente 1 ",null,"Dependente 2 ",null,"Dependente 3",null,"Dependente 4"]
[null,"SOMA TOTAL →",null,{"$f":"IF(E247=0,0,IF(D250>D247,D247,D245*D246))","v":0},null,{"$f":"IF(G247=0,0,IF(F250>D247,D247,F245*D246))","v":0},null,{"$f":"IF(I247=0,0,IF(H250>D247,D247,H245*D246))","v":0},null,{"$f":"IF(K247=0,0,IF(J250>D247,D247,J245*D246))","v":0},null,{"$f":"IF(M247=0,0,IF(L250>D247,D247,L245*D246))","v":0},null,{"$f":"IF(O247=0,0,IF(N250>D247,D247,N245*D246))","v":0}]
[null,null,null,{"$f":"D245*D246","v":0},null,{"$f":"F245*D246","v":0},null,{"$f":"H245*D246","v":0},null,{"$f":"J245*D246","v":0},null,{"$f":"L245*D246","v":0},null,{"$f":"N245*D246","v":0}]
[]
[null," Art.º 74.º do CIRS - Rendimentos produzidos em anos anteriores Cat. H",null,null,null,null,null,null,null,null,null,null,{"$f":"Artigos!F51","v":0}]
[null,"T.  Separada →",null,{"$f":"IF(X253=1,D255,0)","v":0},null,{"$f":"IF(X253=1,J255+L255,0)","v":0},null,{"$f":"IF(X253=1,D256,0)","v":0},null,{"$f":"IF(X253=1,J256+L256,0)","v":0},null,null,{"$f":"Artigos!F69","v":0},null,null,null,null,null,null,null,null,null,null,{"$f":"R46","v":1},{"$f":"IF(Z257=TRUE,4,IF(Z258=TRUE,4,IF(Z259=TRUE,1,S46)))","v":1}]
[null,"Nº de Anos →",null,null,{"$f":"O31+1","v":1},null,{"$f":"Q31+1","v":1},null,null,null,null,null,null,"Rendimento Bruto",null,"Dedução Específica",null,"Rendimento Coletável",null,"Rendi. Anos Anteriores",null,"TAXA","Parcela a Abater",null,{"$f":"D255*H255","v":0}]
[null,"Sujeito Passivo A  →",null,{"$f":"IF(N255<1,0,(T255*R255)/N255*(E254-1)/E254)","v":0},null,{"$f":"(R255-D255+0)","v":0},null,{"$f":"(F255*V255)-W255","v":0},null,{"$f":"IF(X253=1,0,IF(N255<1,0,IF(R255<1,0,(H255*D255)/F255)))","v":0},null,{"$f":"IF(Y254<=0,0,IF(X253=0,0,Y254/M252))","v":0},null,{"$f":"IF('Modelo 3'!F52=4,0,D172-D182)","v":0},null,{"$f":"D216+D228","v":0},null,{"$f":"IF('Modelo 3'!F52=4,0,IF(N255>P255,N255-P255,0))","v":0},null,{"$f":"O30","v":0},null,{"$f":"IF(X253=0,Artigos!B32,IF(X253=1,Artigos!B50,0))","v":0},{"$f":"IF(X253=0,Artigos!B33,IF(X253=1,Artigos!B51,0))","v":0},null,{"$f":"D256*H256","v":0}]
[null,"Sujeito Passivo B  →",null,{"$f":"IF(N256<1,0,(T256*R256)/N256*(G254-1)/G254)","v":0},null,{"$f":"(R256-D256+0)","v":0},null,{"$f":"(F256*V256)-W256","v":0},null,{"$f":"IF(X253=1,0,IF(N256<1,0,IF(R256<1,0,(H256*D256)/F256)))","v":0},null,{"$f":"IF(Y255<=0,0,IF(X253=0,0,Y255/M253))","v":0},null,{"$f":"IF('Modelo 3'!F52=4,0,F172-F182)","v":0},null,{"$f":"F216+F228","v":0},null,{"$f":"IF('Modelo 3'!F52=4,0,IF(N256>P256,N256-P256,0))","v":0},null,{"$f":"Q30","v":0},null,{"$f":"IF(X253=0,Artigos!B32,IF(X253=1,Artigos!B68,0))","v":0},{"$f":"IF(X253=0,Artigos!B33,IF(X253=1,Artigos!B69,0))","v":0}]
[null,"SOMA TOTAL →",null,{"$f":"SUM(D255:E256)","v":0},null,null,null,null,null,null,null,{"$f":"SUM(J255:M256)","v":0},null,null,null,null,null,null,null,null,null,null,null,null,null,{"$f":"'Modelo 3'!D43","v":0}]
[null,"Continente ",null,"SOMA",{"$f":"SUM(D257)","v":0},null,{"$f":"IF(Y253=1,E258,)","v":0},null,{"$f":"SUM(L257)","v":0},null,{"$f":"IF(Y253=1,I258,)","v":0},null,null,"T. Separado",null,null,"T. Separado",null,null,null,null,null,null,null,null,{"$f":"'Modelo 3'!E43","v":0}]
[null,"Açores ",null,"SOMA",{"$f":"IF(E258<0,0,E258)","v":0},null,{"$f":"IF(Y253=2,E259,)","v":0},null,{"$f":"IF(I258<0,0,I258)","v":0},null,{"$f":"IF(Y253=2,I259,)","v":0},null,"SP A→",{"$f":"SUM(D253)","v":0},null,"SP B→",{"$f":"SUM(H253)","v":0},null,"← Quociente dos rendimentos de anos anteriores",null,null,null,null,null,null,{"$f":"'Modelo 3'!F43","v":0}]
[null,"Madeira",null,"SOMA",{"$f":"IF(E258<0,0,E258)","v":0},null,{"$f":"IF(Y253=3,E260,)","v":0},null,{"$f":"IF(I258<0,0,I258)","v":0},null,{"$f":"IF(Y253=3,I260,)","v":0},null,"SP A→",{"$f":"SUM(F253)","v":0},null,"SP B→",{"$f":"SUM(J253)","v":0},null,"← Imposto correspondente a rendimentos de anos anteriores"]
[null,{"$f":"IF(E258<0,0,SUM(G258:H260))","v":0},null,"← Quociente dos rendimentos de anos anteriores"]
[null,{"$f":"IF(I258<0,0,SUM(K258:L260))","v":0},null,"← Imposto correspondente a rendimentos de anos anteriores"]
[]
[]
[]
[]
[]
[]
[null,"FIM"]

{"sheet":"Anexo B","index":3,"n_rows":231,"n_cols":33,"rows_kept":231,"cut":false,"hidden":false,"merged":[[64,31,64,32],[58,1,58,6],[60,15,60,16],[60,17,60,18],[60,19,60,20],[60,21,60,22],[222,1,222,2],[223,1,223,2],[220,1,220,2],[220,4,220,5],[220,6,220,7],[220,8,220,9],[220,10,220,11],[220,13,220,14],[190,1,190,2],[191,1,191,2],[209,1,209,2],[219,13,219,14],[194,1,194,2],[195,1,195,2],[196,1,196,2],[197,1,197,2],[196,3,196,4],[198,1,198,2],[184,1,184,2],[185,1,185,2],[186,1,186,2],[220,16,220,17],[221,1,221,2],[221,4,221,5],[221,6,221,7],[221,8,221,9],[221,10,221,11],[221,13,221,14],[221,16,221,17],[214,1,214,2],[214,3,214,4],[214,5,214,6],[214,7,214,8],[214,9,214,10],[219,16,219,17],[217,1,217,2],[217,3,217,4],[218,1,218,2],[218,3,218,4],[218,11,218,12],[219,1,219,2],[219,4,219,5],[219,6,219,7],[219,8,219,9],[219,10,219,11],[158,16,158,17],[208,5,208,6],[217,19,217,20],[211,1,211,2],[206,3,206,4],[187,1,187,2],[186,3,186,4],[186,7,186,8],[186,9,186,10],[188,1,188,2],[189,1,189,2],[159,16,159,17],[160,16,160,17],[177,5,177,6],[177,12,177,13],[178,5,178,6],[179,5,179,6],[180,5,180,6],[178,8,178,9],[179,8,179,9],[180,8,180,9],[217,22,217,23],[215,19,215,20],[215,22,215,23],[209,8,209,9],[210,8,210,9],[209,11,209,12],[210,11,210,12],[188,5,188,6],[189,5,189,6],[190,5,190,6],[188,8,188,9],[189,8,189,9],[190,8,190,9],[217,5,217,6],[217,7,217,8],[217,9,217,10],[217,11,217,12],[217,13,217,14],[217,15,217,16],[217,17,217,18],[196,7,196,8],[196,9,196,10],[196,5,196,6],[215,24,215,25],[216,1,216,2],[216,3,216,4],[216,5,216,6],[216,7,216,8],[216,9,216,10],[216,11,216,12],[216,13,216,14],[216,15,216,16],[216,17,216,18],[216,19,216,20],[216,22,216,23],[216,24,216,25],[215,1,215,2],[215,13,215,14],[215,15,215,16],[215,17,215,18],[178,1,178,2],[179,1,179,2],[180,1,180,2],[181,1,181,2],[170,1,170,2],[171,1,171,2],[175,1,175,2],[174,1,174,2],[177,1,177,2],[172,1,172,2],[173,1,173,2],[176,1,176,2],[151,3,151,4],[158,1,158,2],[159,1,159,2],[169,1,169,2],[168,3,168,4],[169,3,169,4],[168,12,168,13],[169,10,169,11],[160,1,160,2],[161,1,161,2],[151,7,151,8],[151,9,151,10],[164,1,164,2],[165,1,165,2],[166,1,166,2],[168,5,168,6],[168,10,168,11],[158,5,158,6],[159,5,159,6],[160,5,160,6],[158,8,158,9],[159,8,159,9],[160,8,160,9],[167,1,167,2],[123,1,123,2],[124,1,124,2],[125,1,125,2],[117,14,117,15],[117,21,117,22],[117,28,117,29],[122,5,122,6],[123,5,123,6],[124,5,124,6],[122,8,122,9],[123,8,123,9],[124,8,124,9],[117,7,117,8],[117,1,117,2],[121,1,121,2],[120,1,120,2],[122,1,122,2],[52,1,52,6],[53,15,53,16],[35,19,35,20],[48,17,48,18],[49,17,49,18],[50,17,50,18],[45,15,45,16],[46,15,46,16],[47,15,47,16],[48,15,48,16],[49,15,49,16],[50,15,50,16],[40,15,40,16],[40,17,40,18],[53,17,53,18],[45,17,45,18],[46,17,46,18],[47,17,47,18],[37,19,37,20],[64,19,64,20],[41,15,41,16],[42,15,42,16],[43,15,43,16],[44,15,44,16],[41,17,41,18],[42,17,42,18],[36,17,36,18],[37,17,37,18],[43,17,43,18],[44,17,44,18],[64,17,64,18],[54,15,54,16],[55,15,55,16],[56,15,56,16],[54,17,54,18],[55,17,55,18],[56,17,56,18],[4,15,4,17],[39,1,39,6],[24,21,24,22],[25,21,25,22],[26,21,26,22],[27,21,27,22],[28,21,28,22],[29,21,29,22],[17,21,17,22],[18,21,18,22],[20,21,20,22],[21,21,21,22],[22,21,22,22],[23,21,23,22],[11,21,11,22],[12,21,12,22],[13,21,13,22],[14,21,14,22],[15,21,15,22],[16,21,16,22],[33,1,33,6],[35,15,35,16],[27,19,27,20],[28,19,28,20],[29,19,29,20],[30,19,30,20],[31,19,31,20],[6,21,6,22],[7,21,7,22],[8,21,8,22],[9,21,9,22],[10,21,10,22],[21,19,21,20],[22,19,22,20],[23,19,23,20],[24,19,24,20],[25,19,25,20],[26,19,26,20],[14,19,14,20],[15,19,15,20],[16,19,16,20],[17,19,17,20],[18,19,18,20],[20,19,20,20],[30,21,30,22],[31,21,31,22],[6,19,6,20],[7,19,7,20],[8,19,8,20],[9,19,9,20],[10,19,10,20],[11,19,11,20],[12,19,12,20],[13,19,13,20],[24,17,24,18],[17,17,17,18],[18,17,18,18],[20,17,20,18],[21,17,21,18],[22,17,22,18],[23,17,23,18],[11,17,11,18],[12,17,12,18],[16,17,16,18],[28,15,28,16],[29,15,29,16],[30,15,30,16],[31,15,31,16],[25,15,25,16],[26,15,26,16],[30,17,30,18],[31,17,31,18],[25,17,25,18],[26,17,26,18],[27,17,27,18],[28,17,28,18],[29,17,29,18],[9,15,9,16],[10,15,10,16],[11,15,11,16],[12,15,12,16],[13,15,13,16],[13,17,13,18],[14,17,14,18],[15,17,15,18],[27,15,27,16],[5,15,5,16],[5,17,5,18],[5,19,5,20],[5,21,5,22],[6,15,6,16],[7,15,7,16],[29,14,30,14],[3,1,3,6],[6,17,6,18],[7,17,7,18],[8,17,8,18],[9,17,9,18],[10,17,10,18],[21,15,21,16],[22,15,22,16],[23,15,23,16],[24,15,24,16],[14,15,14,16],[15,15,15,16],[16,15,16,16],[17,15,17,16],[18,15,18,16],[20,15,20,16],[8,15,8,16],[35,21,35,22],[63,21,63,22],[36,21,36,22],[37,21,37,22],[64,21,64,22],[32,1,32,13],[34,15,34,16],[34,17,34,18],[34,19,34,20],[34,21,34,22],[61,15,61,16],[62,15,62,16],[61,17,61,18],[62,17,62,18],[61,19,61,20],[62,19,62,20],[63,15,63,16],[36,15,36,16],[37,15,37,16],[64,15,64,16],[35,17,35,18],[63,17,63,18],[63,19,63,20],[36,19,36,20],[76,19,76,20],[76,22,76,23],[82,1,82,2],[82,4,82,5],[82,7,82,8],[82,10,82,11],[19,15,19,16],[19,17,19,18],[19,19,19,20],[19,21,19,22],[70,1,70,2],[70,4,70,5],[70,7,70,8],[70,10,70,11],[70,13,70,14],[70,16,70,17],[76,1,76,2],[76,4,76,5],[76,7,76,8],[76,10,76,11],[76,13,76,14],[76,16,76,17],[61,21,61,22],[62,21,62,22],[98,28,98,29],[95,1,95,2],[96,1,96,2],[97,1,97,2],[106,1,106,2],[108,1,108,2],[114,1,114,2],[98,12,98,13],[99,12,99,13],[98,19,98,20],[99,19,99,20],[98,5,98,6],[99,5,99,6],[97,5,97,6],[97,12,97,13],[97,19,97,20],[97,26,97,27],[98,7,98,8],[98,14,98,15],[98,26,98,27],[99,26,99,27],[98,21,98,22],[207,1,207,2],[208,1,208,2],[144,5,144,6],[142,8,142,9],[143,8,143,9],[144,8,144,9],[145,1,145,2],[132,3,132,4],[133,3,133,4],[135,3,135,4],[136,3,136,4],[137,3,137,4],[138,3,138,4],[139,3,139,4],[138,1,139,2],[148,1,148,2],[149,1,149,2],[150,1,150,2],[152,1,152,2],[153,1,153,2],[154,1,154,2],[156,1,156,2],[157,1,157,2],[151,1,151,2],[142,5,142,6],[143,5,143,6],[14,29,15,31],[210,1,210,2],[131,5,131,6],[131,7,131,8],[131,9,131,10],[131,11,131,12],[127,14,127,15],[142,1,142,2],[143,1,143,2],[144,1,144,2],[128,1,128,2],[129,1,129,2],[130,1,130,2],[140,5,141,5],[140,7,141,7],[140,9,141,9],[206,5,206,6],[206,7,206,8],[206,9,206,10],[204,1,204,2],[205,1,205,2],[206,1,206,2],[70,19,70,20],[13,10,13,12],[140,11,141,11],[210,5,210,6],[9,1,10,12],[41,1,42,12],[11,1,12,13],[14,1,15,9],[14,10,15,13],[16,1,17,13],[43,1,44,13],[209,5,209,6],[199,11,199,12],[200,11,200,12],[199,1,199,2],[200,1,200,2],[201,1,201,2],[198,5,198,6],[199,5,199,6],[200,5,200,6],[198,8,198,9],[199,8,199,9],[200,8,200,9],[198,11,198,12]]}
[]
[]
[]
[null," QUADRO 4A "]
[null,"RENDIMENTOS PROFISSIONAIS, COMERCIAIS E INDUSTRIAIS",null,null,null,null,null,null,null,null,null,null,null,null,null,{"$f":"TEXT(B89,)","v":""}]
[null,"RENDIMENTOS EMPRESARIAIS E PROFISSIONAIS - [Artigos 3.º, 4.º e 31.º do CIRS]  (Regime Simplificado) ",null,null,null,null,null,null,null,null,null,null,null,null,"Campo","Sujeito Passivo A",null,"Sujeito Passivo B",null,"Dependente 1",null,"Dependente 2"]
[null,"Início de atividade: Os sujeitos passivos estão abrangidos pelo n.º 10 do art.º 31.º do CIRS ?",null,null,null,null,null,null,null,null,null,null,null,null,"☞","Indique aqui",null,"Indique aqui",null,"Indique aqui",null,"Indique aqui"]
[null,"A totalidade dos rendimentos auferidos resulta de serviços prestados a uma única entidade ?",null,null,null,null,null,null,null,null,null,null,null,null,"☞","Indique aqui",null,"Indique aqui",null,"Indique aqui",null,"Indique aqui"]
[null,"Em caso afirmativo, opta pela tributação segundo as regras estabelecidas para a categoria A ? ",null,null,null,null,null,null,null,null,null,null,null,null,"☞","Indique aqui",null,"Indique aqui",null,"Indique aqui",null,"Indique aqui",null,null,"Coeficientes"]
[null,"Vendas de mercadorias e produtos",null,null,null,null,null,null,null,null,null,null,null,null,"Ato isolado\n401 \n",null,null,null,null,null,null,null,null,null,{"$f":"L101","v":0.15}]
[null,null,null,null,null,null,null,null,null,null,null,null,null,null,401,null,null,null,null,null,null,null,null,null,0.15]
[null,"\nPrestações de serviços de atividades hoteleiras  e similares, restauração e bebidas\n",null,null,null,null,null,null,null,null,null,null,null,null,"Ato isolado\n415/416 \n",null,null,null,null,null,null,null,null,null,0.15]
[null,null,null,null,null,null,null,null,null,null,null,null,null,null,"415/416",null,null,null,null,null,null,null,null,null,0.15]
[null,"Exploração de estabelecimentos de alojamento local  [Modalidade de moradia ou apartamento]",null,null,null,null,null,null,null,null,"POSSUI ESTABELECIMENTO ESTÁVEL? ➤",null,null,"Indique aqui",417,null,null,null,null,null,null,null,null,null,0.35]
[null,"Rendimento das atividades profissionais especificamente previstas na Tabela do art.º 151.º do CIRS",null,null,null,null,null,null,null,null,"Veja aqui a Tabela atividade do art.º 151.º do CIRS",null,null,null,"Ato isolado\n403 \n",null,null,null,null,null,null,null,null,null,0.75,{"$f":"C81+O81","v":2},{"$f":"F81+R81","v":2},{"$f":"I81+U81","v":2},{"$f":"L81+X81","v":2},"← Opção pela categoria A"]
[null,null,null,null,null,null,null,null,null,null,null,null,null,null,403,null,null,null,null,null,null,null,null,"b)",0.75,{"$f":"IF(Z15=4,P16+P18+P21,)","v":0},{"$f":"IF(AA15=4,R16+R18+R21,)","v":0},{"$f":"IF(AB15=4,T16+T18+T21,)","v":0},{"$f":"IF(AC15=4,V16+V18+V21,)","v":0}]
[null,"Rendimentos de prestações de serviços não previstos nos campos anteriores  [inserir nestas linhas o código 1519 - outros prestadores de serviços]",null,null,null,null,null,null,null,null,null,null,null,null,"Ato isolado\n404 \n",null,null,null,null,null,null,null,null,null,0.35]
[null,null,null,null,null,null,null,null,null,null,null,null,null,null,404,null,null,null,null,null,null,null,null,"c)",0.35]
[null,"Propriedade intelectual, estes rendimentos estão abrangidos pelo art.º 58.º do EBF ?",null,null,null,null,null,null,null,null,null,null,null,null,"☞","Indique aqui",null,"Indique aqui",null,"Indique aqui",null,"Indique aqui"]
[null,{"$f":"TEXT(B91,)","v":"Propriedade intelectual (não abrangida pelo art.º 58.º do EBF), industrial ou de prestação de informações"},null,null,null,null,null,null,null,null,null,null,null,null,{"$f":"IF(B90=1,\"405\",IF(B90=2,\"406\"))","v":"405"},null,null,null,null,null,null,null,null,null,{"$f":"L110","v":0.95}]
[null,"Rendimentos de atividades financeiras  [Códigos CAE iniciados por 64, 65 ou 66]",null,null,null,null,null,null,null,null,null,null,null,null,408,null,null,null,null,null,null,null,null,null,0.75]
[null,"Serviços prestados por sócios a sociedades de profissionais do Regime de Transparência Fiscal",null,null,null,null,null,null,null,null,null,null,null,null,409,null,null,null,null,null,null,null,null,null,1]
[null,"Resultado positivo de rendimentos prediais",null,null,null,null,null,null,null,null,null,null,null,null,410,null,null,null,null,null,null,null,null,null,0.95]
[null,"Rendimentos de capitais imputáveis a atividade geradora de rendimentos da Categoria B",null,null,null,null,null,null,null,null,null,null,null,null,411,null,null,null,null,null,null,null,null,null,0.95]
[null,"Subsídios à exploração",null,null,null,null,null,null,null,null,null,null,null,null,412,null,null,null,null,null,null,null,null,"f)",0.1]
[null,"Outros subsídios",null,null,null,null,null,null,null,null,null,null,null,null,413,null,null,null,null,null,null,null,null,null,0.3]
[null,"Rendimentos da Categoria B não incluídos nos campos anteriores",null,null,null,null,null,null,null,null,null,null,null,null,414,null,null,null,null,null,null,null,null,null,0.1]
[null,"Retenções  na fonte de IRS "]
[null,"Pagamentos por conta "]
[null,"Rendimentos de anos anteriores  [Incluídos no Quadro 4 do Anexo B]",null,null,null,null,null,null,null,null,null,null,null,null,"Quadro 4"]
[null,"Indique o N.º de anos"]
[null,"Perdas a reportar do exercício de 2017 a deduzir ao rendimento de 2018   [Veja a Demonstração de Liquidação de IRS do exercício de 2017, enviada pela AT]"]
[]
[null,"QUADRO 7A"]
[null,"ENCARGOS - NATUREZA",null,null,null,null,null,null,null,null,null,null,null,null,"Campo","Sujeito Passivo A",null,"Sujeito Passivo B",null,"Dependente 1",null,"Dependente 2"]
[null,"Contribuições obrigatórias para regimes de proteção social - n.º 2 do art.º 25.º do CIRS  [Se optou pelas regras da categoria A, insira nesta linha as contribuições]",null,null,null,null,null,null,null,null,null,null,null,null,701]
[null,"Quotizações para ordens profissionais - n.º 4 do art.º 25.º do CIRS  [Se optou pelas regras da categoria A, insira nesta linha as quotizações para ordens profissionais]",null,null,null,null,null,null,null,null,null,null,null,null,703]
[null,"Quotizações sindicais  [Se optou pelas regras da categoria A, insira nesta linha as quotizações sindicais]",null,null,null,null,null,null,null,null,null,null,null,null,707]
[]
[null,"QUADRO 4B"]
[null,"RENDIMENTOS AGRÍCOLAS, SILVÍCOLAS E PECUÁRIOS ",null,null,null,null,null,null,null,null,null,null,null,null,"Campo","Sujeito Passivo A",null,"Sujeito Passivo B",null,null,"Coeficientes"]
[null,"Vendas de produtos com exceção das incluídas no campo 457",null,null,null,null,null,null,null,null,null,null,null,null,"Ato isolado\n451 \n",null,null,null,null,null,0.15]
[null,null,null,null,null,null,null,null,null,null,null,null,null,null,451,null,null,null,null,null,0.15]
[null,"Prestações de serviços",null,null,null,null,null,null,null,null,null,null,null,null,"Ato isolado\n452 \n",null,null,null,null,null,0.35]
[null,null,null,null,null,null,null,null,null,null,null,null,null,null,452,null,null,null,null,"b)",{"$f":"J174","v":0.35}]
[null,"Subsídios à exploração",null,null,null,null,null,null,null,null,null,null,null,null,455,null,null,null,null,"f)",{"$f":"J175","v":0.1}]
[null,"Outros subsídios",null,null,null,null,null,null,null,null,null,null,null,null,456,null,null,null,null,null,0.3]
[null,"Rendimentos de atividades agrícolas, não incluídos nos campos anteriores ",null,null,null,null,null,null,null,null,null,null,null,null,458,null,null,null,null,null,0.1]
[null,"Retenções  na fonte de IRS "]
[null,"Pagamentos por conta"]
[null,"Perdas a reportar do exercício de 2017 a deduzir ao rendimento de 2018  [Veja a Demonstração de Liquidação de IRS do exercício de 2017, enviada pela AT]"]
[]
[null,"QUADRO 7A"]
[null,"ENCARGOS - NATUREZA",null,null,null,null,null,null,null,null,null,null,null,null,"Campo","Sujeito Passivo A",null,"Sujeito Passivo B"]
[null,"Contribuições obrigatórias para regimes de proteção social [Referentes a rendimentos agrícolas, silvícolas e pecuários]",null,null,null,null,null,null,null,null,null,null,null,null,702]
[null,"Quotizações para ordens profissionais [Referentes a rendimentos agrícolas, silvícolas e pecuários]",null,null,null,null,null,null,null,null,null,null,null,null,704]
[null,"Quotizações sindicais [Referentes a rendimentos agrícolas, silvícolas e pecuários]",null,null,null,null,null,null,null,null,null,null,null,null,708]
[]
[null,"QUADRO 17A e 17C"]
[null,"DESPESAS E ENCARGOS PREVISTOS NO N.º 2 E NAS ALÍNEAS a), b), c), e) E f) DO N.º 13 DO ART.º 31.º DO CIRS "]
[null," NATUREZA \n\n",null,null,null,null,null,null,null,null,null,null,null,null,"Campo","Sujeito Passivo A",null,"Sujeito Passivo B",null,"Dependente 1",null,"Dependente 2"]
[null,"Contribuições obrigatórias para regimes de proteção social - alínea a) do n.º 13 do artigo 31.º do CIRS  [Conexas com a tabela das atividades do art.º 151.º do CIRS] ",null,null,null,null,null,null,null,null,null,null,null,null,17001]
[null,"Contribuições obrigatórias para regimes de proteção social - alínea a) do n.º 13 do artigo 31.º do CIRS [Conexas com a atividade de Alojamento Local]",null,null,null,null,null,null,null,null,null,null,null,null,17001]
[null,"Quotizações para ordens profissionais - alínea e) do n.º 13 do artigo 31.º do CIRS   [Conexas com a tabela das atividades do art.º 151.º do CIRS]",null,null,null,null,null,null,null,null,null,null,null,null,17054]
[null,"Insira nesta linha, as despesas suportadas por faturas, conexas com a atividade da tabela de atividades do art.º 151.º do CIRS e Alojamento Local ➤",null,null,null,null,null,null,null,null,null,null,null,null,"17051 A 17054 ",null,null,null,null,null,null,null,null,{"$f":"TEXT(B93,)","v":""},null,null,null,null,null,null,null,{"$f":"M93","v":""}]
[]
[]
[]
[null,"INICIO"]
[]
[null,null,null,null,null,null,null,"Início de atividade SP A",null,null,"Início de atividade SP B",null,null,"Início de atividade Dep. 1",null,null,"Início de atividade Dep. 2",null,null,"Estabelecimento estável"]
[null,null,null,null,null,null,null,"Indique aqui",1,null,"Indique aqui",1,null,"Indique aqui",1,null,"Indique aqui",1,null,"Indique aqui",1]
[null,null,null,null,null,null,null,"SIM - 1.º ano. (50%)",2,null,"SIM - 1.º ano. (50%)",2,null,"SIM - 1.º ano. (50%)",2,null,"SIM - 1.º ano. (50%)",2,null,"Sim ",2]
[null,null,null,null,null,null,null,"SIM - 2.º ano. (25%)",3,null,"SIM - 2.º ano. (25%)",3,null,"SIM - 2.º ano. (25%)",3,null,"SIM - 2.º ano. (25%)",3,null,"Não",3]
[null,null,null,null,null,null,null,null,{"$f":"VLOOKUP(P7,H72:I74,2,FALSE)","v":1},null,null,{"$f":"VLOOKUP(R7,K72:L74,2,FALSE)","v":1},null,null,{"$f":"VLOOKUP(T7,N72:O74,2,FALSE)","v":1},null,null,{"$f":"VLOOKUP(V7,Q72:R74,2,FALSE)","v":1},null,null,{"$f":"VLOOKUP(N14,T72:U74,2,FALSE)","v":1}]
[]
[null,"Prestação de serviço a uma única entidade SP A",null,null,"Prestação de serviço a uma única entidade SP B",null,null,"Prestação de serviço a uma única entidade Dep. 1",null,null,"Prestação de serviço a uma única entidade Dep. 2",null,null,"Regras categoria A SP A",null,null,"Regras categoria A SP B",null,null,"Regras categoria A Dep.1",null,null,"Regras categoria A Dep.2"]
[null,"Indique aqui",1,null,"Indique aqui",1,null,"Indique aqui",1,null,"Indique aqui",1,null,"Indique aqui",1,null,"Indique aqui",1,null,"Indique aqui",1,null,"Indique aqui",1]
[null,"Sim",2,null,"Sim",2,null,"Sim",2,null,"Sim",2,null,"Sim",2,null,"Sim",2,null,"Sim",2,null,"Sim",2]
[null,"Não",3,null,"Não",3,null,"Não",3,null,"Não",3,null,"Não",3,null,"Não",3,null,"Não",3,null,"Não",3]
[null,null,{"$f":"VLOOKUP(P8,B78:C80,2,FALSE)","v":1},null,null,{"$f":"VLOOKUP(R8,E78:F80,2,FALSE)","v":1},null,null,{"$f":"VLOOKUP(T8,H78:I80,2,FALSE)","v":1},null,null,{"$f":"VLOOKUP(V8,K78:L80,2,FALSE)","v":1},null,null,{"$f":"VLOOKUP(P9,N78:O80,2,FALSE)","v":1},null,null,{"$f":"VLOOKUP(R9,Q78:R80,2,FALSE)","v":1},null,null,{"$f":"VLOOKUP(T9,T78:U80,2,FALSE)","v":1},null,null,{"$f":"VLOOKUP(V9,W78:X80,2,FALSE)","v":1}]
[null,null,null,null,null,null,null,null,null,null,null,null,null,{"$f":"IF(C81=2,2,)","v":0},{"$f":"IF(O81=2,2,)","v":0},null,{"$f":"IF(F81=2,2,)","v":0},{"$f":"IF(R81=2,2,)","v":0},null,{"$f":"IF(I81=2,2,)","v":0},{"$f":"IF(U81=2,2,)","v":0},null,{"$f":"IF(L81=2,2,)","v":0},{"$f":"IF(X81=2,2,)","v":0}]
[null,"Propriedade intelectual art.º 58.º EBF SP A",null,null,"Propriedade intelectual art.º 58.º EBF SPB",null,null,"Propriedade intelectual art.º 58.º EBF Dep.1",null,null,"Propriedade intelectual art.º 58.º EBF Dep.2",null,null,null,{"$f":"SUM(N82:O82)","v":0},null,null,{"$f":"SUM(Q82:R82)","v":0},null,null,{"$f":"SUM(T82:U82)","v":0},null,null,{"$f":"SUM(W82:X82)","v":0}]
[null,"Indique aqui",1,null,"Indique aqui",1,null,"Indique aqui",1,null,"Indique aqui",1]
[null,"Não",1,null,"Não",1,null,"Não",1,null,"Não",1]
[null,"Sim",2,null,"Sim",2,null,"Sim",2,null,"Sim",2]
[null,null,{"$f":"VLOOKUP(P19,B84:C86,2,FALSE)","v":1},null,null,{"$f":"VLOOKUP(R19,E84:F86,2,FALSE)","v":1},null,null,{"$f":"VLOOKUP(T19,H84:I86,2,FALSE)","v":1},null,null,{"$f":"VLOOKUP(V19,K84:L86,2,FALSE)","v":1}]
[]
[]
[null,{"$f":"IF(C87+F87<=2,1,IF(C87+F87>=2,2,))","v":1}]
[null,{"$f":"IF(B90=1,\"Propriedade intelectual (não abrangida pelo art.º 58.º do EBF), industrial ou de prestação de informações\",IF(B90=2,\"Propriedade intelectual (rendimentos abrangidos pelo art.º 58.º do EBF - parte não isenta)\",))","v":"Propriedade intelectual (não abrangida pelo art.º 58.º do EBF), industrial ou de prestação de informações"}]
[null,{"$f":"IF(B126+B146+B182+Q160+Q161=0,\"➤\",IF(B126+B146+B182+Q160+Q161>=1,\"Tem\",))","v":"➤"}]
[null,{"$f":"IF(L93>=0.001,\"← Para não ter agravamento, terá de justificar nesta linha despesas/encargos no valor de: ➤\",)","v":0},null,null,null,null,null,null,null,null,null,{"$f":"F138+H138+J138+L138","v":0},{"$f":"IF(L93=0,\"\",L93)","v":""}]
[null,"CATEGORIA B"]
[null,"Artigos 3.º, 4.º e 31.º do CIRS - Rendimentos Profissionais, Comerciais e Industriais (Regime Simplificado)"]
[null,"T.  Separada →",null,null,null,{"$f":"IF(W123=1,H118,0)","v":0},null,null,null,null,null,null,{"$f":"IF(W123=1,O118,0)","v":0},null,null,null,null,null,null,{"$f":"IF(W123=1,V118/2,0)","v":0},null,null,null,null,null,null,{"$f":"IF(W123=1,AC118/2,0)","v":0}]
[null,"Isenção ato isolado →",null,{"$f":"IF(F98>=1,0,'Modelo 3'!G36*E97)","v":1715.6},4,null,"Limites →",0.15,2500,null,null,null,null,null,{"$f":"IF(M98>=1,0,'Modelo 3'!G36*E97)","v":1715.6},null,null,null,null,null,null,{"$f":"IF(F98+M98+T98>=1,0,'Modelo 3'!G36*E97)","v":1715.6},null,null,null,null,null,null,{"$f":"IF(F98+M98+AA98>=1,0,'Modelo 3'!G36*E97)","v":1715.6}]
[null,"Soma Cat. A+H →",null,null,null,{"$f":"'Anexo A'!O7+'Anexo A'!O22+'Anexo A'!O23","v":0},null,null,null,null,null,null,{"$f":"'Anexo A'!Q7+'Anexo A'!Q22+'Anexo A'!Q23","v":0},null,null,null,null,null,null,{"$f":"'Anexo A'!S7+'Anexo A'!S22+'Anexo A'!S23","v":0},null,null,null,null,null,null,{"$f":"'Anexo A'!U7+'Anexo A'!U22+'Anexo A'!U23","v":0}]
[null,null,null,null,null,"Sujeito Passivo A ",null,"Rendimento dos dedeficientes ↓",null,{"$f":"'Modelo 3'!H20+'Modelo 3'!H21+'Modelo 3'!H22+'Modelo 3'!H23","v":0},null,null,"Sujeito Passivo B ",null,"Rendimento dos dedeficientes ↓",null,{"$f":"'Modelo 3'!I20+'Modelo 3'!I21+'Modelo 3'!I22+'Modelo 3'!I23","v":0},null,null,"Dependente  1",null,"Rendimento dos dedeficientes ↓",null,{"$f":"'Modelo 3'!J20+'Modelo 3'!J21+'Modelo 3'!J22+'Modelo 3'!J23+'Modelo 3'!K20+'Modelo 3'!K21+'Modelo 3'!K22+'Modelo 3'!K23","v":0},null,null,"Dependente  2",null,"Rendimento dos dedeficientes ↓",null,{"$f":"'Modelo 3'!J20+'Modelo 3'!J21+'Modelo 3'!J22+'Modelo 3'!J23+'Modelo 3'!K20+'Modelo 3'!K21+'Modelo 3'!K22+'Modelo 3'!K23","v":0}]
[null,null,null,"Campo",null,"Rendimento Bruto ↓",null," ≥ 2500","   < 2500","SP A","N/Defi.","Taxa","Rendimento Bruto ↓",null," ≥ 2500","   < 2500","SP A","N/Defi.","Taxa","Rendimento Bruto ↓",null," ≥ 2500","   < 2500","Dep. 1","N/Defi.","Taxa","Rendimento Bruto ↓",null," ≥ 2500","   < 2500","Dep. 2","N/Defi.","Taxa"]
[null,null,null,"Ato isolado 401 ",null,{"$f":"IF(G101=0,0,IF(J99=0,0,(G101/G118)*I97))","v":0},{"$f":"IF(D97=0,P10,IF(P10<=D97,0,P10))","v":0},{"$f":"IF(J99=0,0,IF(J118>=I97,(G101-F101)*L101,0))","v":0},{"$f":"IF(J99=0,0,IF(J118<I97,(G101-J101)*L101,0))","v":0},{"$f":"IF(J99=0,0,G101*H97)","v":0},{"$f":"IF(J99>=1,0,IF(J99=0,(G101*L101)))","v":0},0.15,{"$f":"IF(N101=0,0,IF(Q99=0,0,(N101/N118)*I97))","v":0},{"$f":"IF(O97=0,R10,IF(R10<=O97,0,R10))","v":0},{"$f":"IF(Q99=0,0,IF(Q118>=I97,(N101-M101)*S101,0))","v":0},{"$f":"IF(Q99=0,0,IF(Q118<I97,(N101-Q101)*S101,0))","v":0},{"$f":"IF(Q99=0,0,N101*H97)","v":0},{"$f":"IF(Q99>=1,0,IF(Q99=0,(N101*S101)))","v":0},{"$f":"L101","v":0.15},{"$f":"IF(U101=0,0,IF(X99=0,0,(U101/U118)*I97))","v":0},{"$f":"IF(V97=0,T10,IF(T10<=V97,0,T10))","v":0},{"$f":"IF(X99=0,0,IF(X118>=I97,(U101-T101)*Z101,0))","v":0},{"$f":"IF(X99=0,0,IF(X118<I97,(U101-X101)*Z101,0))","v":0},{"$f":"IF(X99=0,0,U101*H97)","v":0},{"$f":"IF(X99>=1,0,IF(X99=0,(U101*Z101)))","v":0},{"$f":"S101","v":0.15},{"$f":"IF(AB101=0,0,IF(AE99=0,0,(AB101/AB118)*I97))","v":0},{"$f":"IF(AC97=0,V10,IF(V10<=AC97,0,V10))","v":0},{"$f":"IF(AE99=0,0,IF(AE118>=I97,(AB101-AA101)*AG101,0))","v":0},{"$f":"IF(AE99=0,0,IF(AE118<I97,(AB101-AE101)*AG101,0))","v":0},{"$f":"IF(AE99=0,0,AB101*H97)","v":0},{"$f":"IF(AE99>=1,0,IF(AE99=0,(AB101*AG101)))","v":0},{"$f":"Z101","v":0.15}]
[null,null,null,"Campo 401",null,{"$f":"IF(G102=0,0,IF(J99=0,0,(G102/G118)*I97))","v":0},{"$f":"P11","v":0},{"$f":"IF(J99=0,0,IF(J118>=I97,(G102-F102)*S102,0))","v":0},{"$f":"IF(J99=0,0,IF(J118<I97,(G102-J102)*L102,0))","v":0},{"$f":"IF(J99=0,0,G102*H97)","v":0},{"$f":"IF(J99>=1,0,IF(J99=0,(G102*L102)))","v":0},0.15,{"$f":"IF(N102=0,0,IF(Q99=0,0,(N102/N118)*I97))","v":0},{"$f":"R11","v":0},{"$f":"IF(Q99=0,0,IF(Q118>=I97,(N102-M102)*S102,0))","v":0},{"$f":"IF(Q99=0,0,IF(Q118<I97,(N102-Q102)*S102,0))","v":0},{"$f":"IF(Q99=0,0,N102*H97)","v":0},{"$f":"IF(Q99>=1,0,IF(Q99=0,(N102*S102)))","v":0},{"$f":"L102","v":0.15},{"$f":"IF(U102=0,0,IF(X99=0,0,(U102/U118)*I97))","v":0},{"$f":"T11","v":0},{"$f":"IF(X99=0,0,IF(X118>=I97,(U102-T102)*Z102,0))","v":0},{"$f":"IF(X99=0,0,IF(X118<I97,(U102-X102)*Z102,0))","v":0},{"$f":"IF(X99=0,0,U102*H97)","v":0},{"$f":"IF(X99>=1,0,IF(X99=0,(U102*Z102)))","v":0},{"$f":"S102","v":0.15},{"$f":"IF(AB102=0,0,IF(AE99=0,0,(AB102/AB118)*I97))","v":0},{"$f":"V11","v":0},{"$f":"IF(AE99=0,0,IF(AE118>=I97,(AB102-AA102)*AG102,0))","v":0},{"$f":"IF(AE99=0,0,IF(AE118<I97,(AB102-AE102)*AG102,0))","v":0},{"$f":"IF(AE99=0,0,AB102*H97)","v":0},{"$f":"IF(AE99>=1,0,IF(AE99=0,(AB102*AG102)))","v":0},{"$f":"Z102","v":0.15}]
[null,null,null,"Ato isolado 415, 416",null,{"$f":"IF(G103=0,0,IF(J99=0,0,(G103/G118)*I97))","v":0},{"$f":"IF(D97=0,P12,IF(P12<=D97,0,P12))","v":0},{"$f":"IF(J99=0,0,IF(J118>=I97,(G103-F103)*S103,0))","v":0},{"$f":"IF(J99=0,0,IF(J118<I97,(G103-J103)*L103,0))","v":0},{"$f":"IF(J99=0,0,G103*H97)","v":0},{"$f":"IF(J99>=1,0,IF(J99=0,(G103*L103)))","v":0},0.15,{"$f":"IF(N103=0,0,IF(Q99=0,0,(N103/N118)*I97))","v":0},{"$f":"IF(O97=0,R12,IF(R12<=O97,0,R12))","v":0},{"$f":"IF(Q99=0,0,IF(Q118>=I97,(N103-M103)*S103,0))","v":0},{"$f":"IF(Q99=0,0,IF(Q118<I97,(N103-Q103)*S103,0))","v":0},{"$f":"IF(Q99=0,0,N103*H97)","v":0},{"$f":"IF(Q99>=1,0,IF(Q99=0,(N103*S103)))","v":0},0.15,{"$f":"IF(U103=0,0,IF(X99=0,0,(U103/U118)*I97))","v":0},{"$f":"IF(V97=0,T12,IF(T12<=V97,0,T12))","v":0},{"$f":"IF(X99=0,0,IF(X118>=I97,(U103-T103)*Z103,0))","v":0},{"$f":"IF(X99=0,0,IF(X118<I97,(U103-X103)*Z103,0))","v":0},{"$f":"IF(X99=0,0,U103*H97)","v":0},{"$f":"IF(X99>=1,0,IF(X99=0,(U103*Z103)))","v":0},0.15,{"$f":"IF(AB103=0,0,IF(AE99=0,0,(AB103/AB118)*I97))","v":0},{"$f":"IF(AC97=0,V12,IF(V12<=AC97,0,V12))","v":0},{"$f":"IF(AE99=0,0,IF(AE118>=I97,(AB103-AA103)*AG103,0))","v":0},{"$f":"IF(AE99=0,0,IF(AE118<I97,(AB103-AE103)*AG103,0))","v":0},{"$f":"IF(AE99=0,0,AB103*H97)","v":0},{"$f":"IF(AE99>=1,0,IF(AE99=0,(AB103*AG103)))","v":0},0.15]
[null,null,null,"Campos 415  e 416",null,{"$f":"IF(G104=0,0,IF(J99=0,0,(G104/G118)*I97))","v":0},{"$f":"P13","v":0},{"$f":"IF(J99=0,0,IF(J118>=I97,(G104-F104)*S104,0))","v":0},{"$f":"IF(J99=0,0,IF(J118<I97,(G104-J104)*L104,0))","v":0},{"$f":"IF(J99=0,0,G104*H97)","v":0},{"$f":"IF(J99>=1,0,IF(J99=0,(G104*L104)))","v":0},0.15,{"$f":"IF(N104=0,0,IF(Q99=0,0,(N104/N118)*I97))","v":0},{"$f":"R13","v":0},{"$f":"IF(Q99=0,0,IF(Q118>=I97,(N104-M104)*S104,0))","v":0},{"$f":"IF(Q99=0,0,IF(Q118<I97,(N104-Q104)*S104,0))","v":0},{"$f":"IF(Q99=0,0,N104*H97)","v":0},{"$f":"IF(Q99>=1,0,IF(Q99=0,(N104*S104)))","v":0},0.15,{"$f":"IF(U104=0,0,IF(X99=0,0,(U104/U118)*I97))","v":0},{"$f":"T13","v":0},{"$f":"IF(X99=0,0,IF(X118>=I97,(U104-T104)*Z104,0))","v":0},{"$f":"IF(X99=0,0,IF(X118<I97,(U104-X104)*Z104,0))","v":0},{"$f":"IF(X99=0,0,U104*H97)","v":0},{"$f":"IF(X99>=1,0,IF(X99=0,(U104*Z104)))","v":0},0.15,{"$f":"IF(AB104=0,0,IF(AE99=0,0,(AB104/AB118)*I97))","v":0},{"$f":"V13","v":0},{"$f":"IF(AE99=0,0,IF(AE118>=I97,(AB104-AA104)*AG104,0))","v":0},{"$f":"IF(AE99=0,0,IF(AE118<I97,(AB104-AE104)*AG104,0))","v":0},{"$f":"IF(AE99=0,0,AB104*H97)","v":0},{"$f":"IF(AE99>=1,0,IF(AE99=0,(AB104*AG104)))","v":0},0.15]
[null,null,null,"Campo 417",null,{"$f":"IF(G105=0,0,IF(J99=0,0,(G105/G118)*I97))","v":0},{"$f":"IF(F135>D131,0,IF(R131=1,R130,))","v":0},{"$f":"IF(J99=0,0,IF(J118>=I97,(G105-F105)*S105,0))","v":0},{"$f":"IF(J99=0,0,IF(J118<I97,(G105-J105)*L105,0))","v":0},{"$f":"IF(J99=0,0,G105*H97)","v":0},{"$f":"IF(J99>=1,0,IF(J99=0,(G105*L105)))","v":0},0.35,{"$f":"IF(N105=0,0,IF(Q99=0,0,(N105/N118)*I97))","v":0},{"$f":"IF(H135>D131,0,IF(R133=1,R132,))","v":0},{"$f":"IF(Q99=0,0,IF(Q118>=I97,(N105-M105)*S105,0))","v":0},{"$f":"IF(Q99=0,0,IF(Q118<I97,(N105-Q105)*S105,0))","v":0},{"$f":"IF(Q99=0,0,N105*H97)","v":0},{"$f":"IF(Q99>=1,0,IF(Q99=0,(N105*S105)))","v":0},0.35,{"$f":"IF(U105=0,0,IF(X99=0,0,(U105/U118)*I97))","v":0},{"$f":"IF(J135>D131,0,IF(R135=1,R134,))","v":0},{"$f":"IF(X99=0,0,IF(X118>=I97,(U105-T105)*Z105,0))","v":0},{"$f":"IF(X99=0,0,IF(X118<I97,(U105-X105)*Z105,0))","v":0},{"$f":"IF(X99=0,0,U105*H97)","v":0},{"$f":"IF(X99>=1,0,IF(X99=0,(U105*Z105)))","v":0},0.35,{"$f":"IF(AB105=0,0,IF(AE99=0,0,(AB105/AB118)*I97))","v":0},{"$f":"IF(L135>D131,0,IF(R137=1,R136,))","v":0},{"$f":"IF(AE99=0,0,IF(AE118>=I97,(AB105-AA105)*AG105,0))","v":0},{"$f":"IF(AE99=0,0,IF(AE118<I97,(AB105-AE105)*AG105,0))","v":0},{"$f":"IF(AE99=0,0,AB105*H97)","v":0},{"$f":"IF(AE99>=1,0,IF(AE99=0,(AB105*AG105)))","v":0},0.35]
[null,null,null,"Ato isolado 403 ",null,{"$f":"IF(G106=0,0,IF(J99=0,0,(G106/G118)*I97))","v":0},{"$f":"IF(D97=0,P15,IF(P15<=D97,0,P15))","v":0},{"$f":"IF(J99=0,0,IF(J118>=I97,(G106-F106)*S106,0))","v":0},{"$f":"IF(J99=0,0,IF(J118<I97,(G106-J106)*L106,0))","v":0},{"$f":"IF(J99=0,0,G106*H97)","v":0},{"$f":"IF(J99>=1,0,IF(J99=0,(G106*L106)))","v":0},0.75,{"$f":"IF(N106=0,0,IF(Q99=0,0,(N106/N118)*I97))","v":0},{"$f":"IF(O97=0,R15,IF(R15<=O97,0,R15))","v":0},{"$f":"IF(Q99=0,0,IF(Q118>=I97,(N106-M106)*S106,0))","v":0},{"$f":"IF(Q99=0,0,IF(Q118<I97,(N106-Q106)*S106,0))","v":0},{"$f":"IF(Q99=0,0,N106*H97)","v":0},{"$f":"IF(Q99>=1,0,IF(Q99=0,(N106*S106)))","v":0},{"$f":"L106","v":0.75},{"$f":"IF(U106=0,0,IF(X99=0,0,(U106/U118)*I97))","v":0},{"$f":"IF(V97=0,T15,IF(T15<=V97,0,T15))","v":0},{"$f":"IF(X99=0,0,IF(X118>=I97,(U106-T106)*Z106,0))","v":0},{"$f":"IF(X99=0,0,IF(X118<I97,(U106-X106)*Z106,0))","v":0},{"$f":"IF(X99=0,0,U106*H97)","v":0},{"$f":"IF(X99>=1,0,IF(X99=0,(U106*Z106)))","v":0},0.75,{"$f":"IF(AB106=0,0,IF(AE99=0,0,(AB106/AB118)*I97))","v":0},{"$f":"IF(AC97=0,V15,IF(V15<=AC97,0,V15))","v":0},{"$f":"IF(AE99=0,0,IF(AE118>=I97,(AB106-AA106)*AG106,0))","v":0},{"$f":"IF(AE99=0,0,IF(AE118<I97,(AB106-AE106)*AG106,0))","v":0},{"$f":"IF(AE99=0,0,AB106*H97)","v":0},{"$f":"IF(AE99>=1,0,IF(AE99=0,(AB106*AG106)))","v":0},0.75]
[null,"b)",null,"Campo 403",null,{"$f":"IF(G107=0,0,IF(J99=0,0,(G107/G118)*I97))","v":0},{"$f":"IF(F135>D131,0,IF(O83=4,0,IF(Q131=1,Q130,)))","v":0},{"$f":"IF(J99=0,0,IF(J118>=I97,(G107-F107)*S107,0))","v":0},{"$f":"IF(J99=0,0,IF(J118<I97,(G107-J107)*L107,0))","v":0},{"$f":"IF(J99=0,0,G107*H97)","v":0},{"$f":"IF(J99>=1,0,IF(J99=0,(G107*L107)))","v":0},{"$f":"IF(F98>=1,75%,IF(I75=2,37.5%,IF(I75=3,56.25%,75%)))","v":0.75},{"$f":"IF(N107=0,0,IF(Q99=0,0,(N107/N118)*I97))","v":0},{"$f":"IF(H135>D131,0,IF(R83=4,0,IF(Q133=1,Q132,)))","v":0},{"$f":"IF(Q99=0,0,IF(Q118>=I97,(N107-M107)*S107,0))","v":0},{"$f":"IF(Q99=0,0,IF(Q118<I97,(N107-Q107)*S107,0))","v":0},{"$f":"IF(Q99=0,0,N107*H97)","v":0},{"$f":"IF(Q99>=1,0,IF(Q99=0,(N107*S107)))","v":0},{"$f":"IF(M98>=1,75%,IF(L75=2,37.5%,IF(L75=3,56.25%,75%)))","v":0.75},{"$f":"IF(U107=0,0,IF(X99=0,0,(U107/U118)*I97))","v":0},{"$f":"IF(J135>D131,0,IF(U83=4,0,IF(Q135=1,Q134,)))","v":0},{"$f":"IF(X99=0,0,IF(X118>=I97,(U107-T107)*Z107,0))","v":0},{"$f":"IF(X99=0,0,IF(X118<I97,(U107-X107)*Z107,0))","v":0},{"$f":"IF(X99=0,0,U107*H97)","v":0},{"$f":"IF(X99>=1,0,IF(X99=0,(U107*Z107)))","v":0},{"$f":"IF(T98>=1,75%,IF(O75=2,37.5%,IF(O75=3,56.25%,75%)))","v":0.75},{"$f":"IF(AB107=0,0,IF(AE99=0,0,(AB107/AB118)*I97))","v":0},{"$f":"IF(L135>D131,0,IF(X83=4,0,IF(Q137=1,Q136,)))","v":0},{"$f":"IF(AE99=0,0,IF(AE118>=I97,(AB107-AA107)*AG107,0))","v":0},{"$f":"IF(AE99=0,0,IF(AE118<I97,(AB107-AE107)*AG107,0))","v":0},{"$f":"IF(AE99=0,0,AB107*H97)","v":0},{"$f":"IF(AE99>=1,0,IF(AE99=0,(AB107*AG107)))","v":0},{"$f":"IF(AA98>=1,75%,IF(R75=2,37.5%,IF(R75=3,56.25%,75%)))","v":0.75}]
[null,null,null,"Ato isolado 404 ",null,{"$f":"IF(G108=0,0,IF(J99=0,0,(G108/G118)*I97))","v":0},{"$f":"IF(D97=0,P17,IF(P17<=D97,0,P17))","v":0},{"$f":"IF(J99=0,0,IF(J118>=I97,(G108-F108)*S108,0))","v":0},{"$f":"IF(J99=0,0,IF(J118<I97,(G108-J108)*L108,0))","v":0},{"$f":"IF(J99=0,0,G108*H97)","v":0},{"$f":"IF(J99>=1,0,IF(J99=0,(G108*L108)))","v":0},0.35,{"$f":"IF(N108=0,0,IF(Q99=0,0,(N108/N118)*I97))","v":0},{"$f":"IF(O97=0,R17,IF(R17<=O97,0,R17))","v":0},{"$f":"IF(Q99=0,0,IF(Q118>=I97,(N108-M108)*S108,0))","v":0},{"$f":"IF(Q99=0,0,IF(Q118<I97,(N108-Q108)*S108,0))","v":0},{"$f":"IF(Q99=0,0,N108*H97)","v":0},{"$f":"IF(Q99>=1,0,IF(Q99=0,(N108*S108)))","v":0},{"$f":"L108","v":0.35},{"$f":"IF(U108=0,0,IF(X99=0,0,(U108/U118)*I97))","v":0},{"$f":"IF(V97=0,T17,IF(T17<=V97,0,T17))","v":0},{"$f":"IF(X99=0,0,IF(X118>=I97,(U108-T108)*Z108,0))","v":0},{"$f":"IF(X99=0,0,IF(X118<I97,(U108-X108)*Z108,0))","v":0},{"$f":"IF(X99=0,0,U108*H97)","v":0},{"$f":"IF(X99>=1,0,IF(X99=0,(U108*Z108)))","v":0},{"$f":"S108","v":0.35},{"$f":"IF(AB108=0,0,IF(AE99=0,0,(AB108/AB118)*I97))","v":0},{"$f":"IF(AC97=0,V17,IF(V17<=AC97,0,V17))","v":0},{"$f":"IF(AE99=0,0,IF(AE118>=I97,(AB108-AA108)*AG108,0))","v":0},{"$f":"IF(AE99=0,0,IF(AE118<I97,(AB108-AE108)*AG108,0))","v":0},{"$f":"IF(AE99=0,0,AB108*H97)","v":0},{"$f":"IF(AE99>=1,0,IF(AE99=0,(AB108*AG108)))","v":0},{"$f":"Z108","v":0.35}]
[null,"c)",null,"Campo 404",null,{"$f":"IF(G109=0,0,IF(J99=0,0,(G109/G118)*I97))","v":0},{"$f":"IF(O83=4,0,P18)","v":0},{"$f":"IF(J99=0,0,IF(J118>=I97,(G109-F109)*S109,0))","v":0},{"$f":"IF(J99=0,0,IF(J118<I97,(G109-J109)*L109,0))","v":0},{"$f":"IF(J99=0,0,G109*H97)","v":0},{"$f":"IF(J99>=1,0,IF(J99=0,(G109*L109)))","v":0},{"$f":"IF(F98>=1,35%,IF(I75=2,17.5%,IF(I75=3,26.25%,35%)))","v":0.35},{"$f":"IF(N109=0,0,IF(Q99=0,0,(N109/N118)*I97))","v":0},{"$f":"IF(R83=4,0,R18)","v":0},{"$f":"IF(Q99=0,0,IF(Q118>=I97,(N109-M109)*S109,0))","v":0},{"$f":"IF(Q99=0,0,IF(Q118<I97,(N109-Q109)*S109,0))","v":0},{"$f":"IF(Q99=0,0,N109*H97)","v":0},{"$f":"IF(Q99>=1,0,IF(Q99=0,(N109*S109)))","v":0},{"$f":"IF(M98>=1,35%,IF(L75=2,17.5%,IF(L75=3,26.25%,35%)))","v":0.35},{"$f":"IF(U109=0,0,IF(X99=0,0,(U109/U118)*I97))","v":0},{"$f":"IF(U83=4,0,T18)","v":0},{"$f":"IF(X99=0,0,IF(X118>=I97,(U109-T109)*Z109,0))","v":0},{"$f":"IF(X99=0,0,IF(X118<I97,(U109-X109)*Z109,0))","v":0},{"$f":"IF(X99=0,0,U109*H97)","v":0},{"$f":"IF(X99>=1,0,IF(X99=0,(U109*Z109)))","v":0},{"$f":"IF(T98>=1,35%,IF(O75=2,17.5%,IF(O75=3,26.25%,35%)))","v":0.35},{"$f":"IF(AB109=0,0,IF(AE99=0,0,(AB109/AB118)*I97))","v":0},{"$f":"IF(X83=4,0,V18)","v":0},{"$f":"IF(AE99=0,0,IF(AE118>=I97,(AB109-AA109)*AG109,0))","v":0},{"$f":"IF(AE99=0,0,IF(AE118<I97,(AB109-AE109)*AG109,0))","v":0},{"$f":"IF(AE99=0,0,AB109*H97)","v":0},{"$f":"IF(AE99>=1,0,IF(AE99=0,(AB109*AG109)))","v":0},{"$f":"IF(AA98>=1,35%,IF(R75=2,17.5%,IF(R75=3,26.25%,35%)))","v":0.35}]
[null,null,null,"Campo",{"$f":"O20","v":"405"},{"$f":"IF(G110=0,0,IF(J99=0,0,(G110/G118)*I97))","v":0},{"$f":"F122","v":0},{"$f":"IF(J99=0,0,IF(J118>=I97,(G110-F110)*S110,0))","v":0},{"$f":"IF(J99=0,0,IF(J118<I97,(G110-J110)*L110,0))","v":0},{"$f":"IF(J99=0,0,G110*H97)","v":0},{"$f":"IF(J99>=1,0,IF(J99=0,(G110*L110)))","v":0},0.95,{"$f":"IF(N110=0,0,IF(Q99=0,0,(N110/N118)*I97))","v":0},{"$f":"M122","v":0},{"$f":"IF(Q99=0,0,IF(Q118>=I97,(N110-M110)*S110,0))","v":0},{"$f":"IF(Q99=0,0,IF(Q118<I97,(N110-Q110)*S110,0))","v":0},{"$f":"IF(Q99=0,0,N110*H97)","v":0},{"$f":"IF(Q99>=1,0,IF(Q99=0,(N110*S110)))","v":0},{"$f":"L110","v":0.95},{"$f":"IF(U110=0,0,IF(X99=0,0,(U110/U118)*I97))","v":0},{"$f":"T122","v":0},{"$f":"IF(X99=0,0,IF(X118>=I97,(U110-T110)*Z110,0))","v":0},{"$f":"IF(X99=0,0,IF(X118<I97,(U110-X110)*Z110,0))","v":0},{"$f":"IF(X99=0,0,U110*H97)","v":0},{"$f":"IF(X99>=1,0,IF(X99=0,(U110*Z110)))","v":0},{"$f":"S110","v":0.95},{"$f":"IF(AB110=0,0,IF(AE99=0,0,(AB110/AB118)*I97))","v":0},{"$f":"AA122","v":0},{"$f":"IF(AE99=0,0,IF(AE118>=I97,(AB110-AA110)*AG110,0))","v":0},{"$f":"IF(AE99=0,0,IF(AE118<I97,(AB110-AE110)*AG110,0))","v":0},{"$f":"IF(AE99=0,0,AB110*H97)","v":0},{"$f":"IF(AE99>=1,0,IF(AE99=0,(AB110*AG110)))","v":0},{"$f":"Z110","v":0.95}]
[null,null,null,"Campo 408",null,{"$f":"IF(G111=0,0,IF(J99=0,0,(G111/G118)*I97))","v":0},{"$f":"IF(O83=4,0,P21)","v":0},{"$f":"IF(J99=0,0,IF(J118>=I97,(G111-F111)*S111,0))","v":0},{"$f":"IF(J99=0,0,IF(J118<I97,(G111-J111)*L111,0))","v":0},{"$f":"IF(J99=0,0,G111*H97)","v":0},{"$f":"IF(J99>=1,0,IF(J99=0,(G111*L111)))","v":0},0.75,{"$f":"IF(N111=0,0,IF(Q99=0,0,(N111/N118)*I97))","v":0},{"$f":"IF(R83=4,0,R21)","v":0},{"$f":"IF(Q99=0,0,IF(Q118>=I97,(N111-M111)*S111,0))","v":0},{"$f":"IF(Q99=0,0,IF(Q118<I97,(N111-Q111)*S111,0))","v":0},{"$f":"IF(Q99=0,0,N111*H97)","v":0},{"$f":"IF(Q99>=1,0,IF(Q99=0,(N111*S111)))","v":0},{"$f":"L111","v":0.75},{"$f":"IF(U111=0,0,IF(X99=0,0,(U111/U118)*I97))","v":0},{"$f":"IF(U83=4,0,T21)","v":0},{"$f":"IF(X99=0,0,IF(X118>=I97,(U111-T111)*Z111,0))","v":0},{"$f":"IF(X99=0,0,IF(X118<I97,(U111-X111)*Z111,0))","v":0},{"$f":"IF(X99=0,0,U111*H97)","v":0},{"$f":"IF(X99>=1,0,IF(X99=0,(U111*Z111)))","v":0},{"$f":"S111","v":0.75},{"$f":"IF(AB111=0,0,IF(AE99=0,0,(AB111/AB118)*I97))","v":0},{"$f":"IF(X83=4,0,V21)","v":0},{"$f":"IF(AE99=0,0,IF(AE118>=I97,(AB111-AA111)*AG111,0))","v":0},{"$f":"IF(AE99=0,0,IF(AE118<I97,(AB111-AE111)*AG111,0))","v":0},{"$f":"IF(AE99=0,0,AB111*H97)","v":0},{"$f":"IF(AE99>=1,0,IF(AE99=0,(AB111*AG111)))","v":0},{"$f":"Z111","v":0.75}]
[null,null,null,"Campo 409",null,{"$f":"IF(G112=0,0,IF(J99=0,0,(G112/G118)*I97))","v":0},{"$f":"P22","v":0},{"$f":"IF(J99=0,0,IF(J118>=I97,(G112-F112)*S112,0))","v":0},{"$f":"IF(J99=0,0,IF(J118<I97,(G112-J112)*L112,0))","v":0},{"$f":"IF(J99=0,0,G112*H97)","v":0},{"$f":"IF(J99>=1,0,IF(J99=0,(G112*L112)))","v":0},1,{"$f":"IF(N112=0,0,IF(Q99=0,0,(N112/N118)*I97))","v":0},{"$f":"R22","v":0},{"$f":"IF(Q99=0,0,IF(Q118>=I97,(N112-M112)*S112,0))","v":0},{"$f":"IF(Q99=0,0,IF(Q118<I97,(N112-Q112)*S112,0))","v":0},{"$f":"IF(Q99=0,0,N112*H97)","v":0},{"$f":"IF(Q99>=1,0,IF(Q99=0,(N112*S112)))","v":0},1,{"$f":"IF(U112=0,0,IF(X99=0,0,(U112/U118)*I97))","v":0},{"$f":"T22","v":0},{"$f":"IF(X99=0,0,IF(X118>=I97,(U112-T112)*Z112,0))","v":0},{"$f":"IF(X99=0,0,IF(X118<I97,(U112-X112)*Z112,0))","v":0},{"$f":"IF(X99=0,0,U112*H97)","v":0},{"$f":"IF(X99>=1,0,IF(X99=0,(U112*Z112)))","v":0},1,{"$f":"IF(AB112=0,0,IF(AE99=0,0,(AB112/AB118)*I97))","v":0},{"$f":"V22","v":0},{"$f":"IF(AE99=0,0,IF(AE118>=I97,(AB112-AA112)*AG112,0))","v":0},{"$f":"IF(AE99=0,0,IF(AE118<I97,(AB112-AE112)*AG112,0))","v":0},{"$f":"IF(AE99=0,0,AB112*H97)","v":0},{"$f":"IF(AE99>=1,0,IF(AE99=0,(AB112*AG112)))","v":0},1]
[null,null,null,"Campo 410",null,{"$f":"IF(G113=0,0,IF(J99=0,0,(G113/G118)*I97))","v":0},{"$f":"P23","v":0},{"$f":"IF(J99=0,0,IF(J118>=I97,(G113-F113)*S113,0))","v":0},{"$f":"IF(J99=0,0,IF(J118<I97,(G113-J113)*L113,0))","v":0},{"$f":"IF(J99=0,0,G113*H97)","v":0},{"$f":"IF(J99>=1,0,IF(J99=0,(G113*L113)))","v":0},0.95,{"$f":"IF(N113=0,0,IF(Q99=0,0,(N113/N118)*I97))","v":0},{"$f":"R23","v":0},{"$f":"IF(Q99=0,0,IF(Q118>=I97,(N113-M113)*S113,0))","v":0},{"$f":"IF(Q99=0,0,IF(Q118<I97,(N113-Q113)*S113,0))","v":0},{"$f":"IF(Q99=0,0,N113*H97)","v":0},{"$f":"IF(Q99>=1,0,IF(Q99=0,(N113*S113)))","v":0},0.95,{"$f":"IF(U113=0,0,IF(X99=0,0,(U113/U118)*I97))","v":0},{"$f":"T23","v":0},{"$f":"IF(X99=0,0,IF(X118>=I97,(U113-T113)*Z113,0))","v":0},{"$f":"IF(X99=0,0,IF(X118<I97,(U113-X113)*Z113,0))","v":0},{"$f":"IF(X99=0,0,U113*H97)","v":0},{"$f":"IF(X99>=1,0,IF(X99=0,(U113*Z113)))","v":0},0.95,{"$f":"IF(AB113=0,0,IF(AE99=0,0,(AB113/AB118)*I97))","v":0},{"$f":"V23","v":0},{"$f":"IF(AE99=0,0,IF(AE118>=I97,(AB113-AA113)*AG113,0))","v":0},{"$f":"IF(AE99=0,0,IF(AE118<I97,(AB113-AE113)*AG113,0))","v":0},{"$f":"IF(AE99=0,0,AB113*H97)","v":0},{"$f":"IF(AE99>=1,0,IF(AE99=0,(AB113*AG113)))","v":0},0.95]
[null,null,null,"Campo 411",null,{"$f":"IF(G114=0,0,IF(J99=0,0,(G114/G118)*I97))","v":0},{"$f":"P24","v":0},{"$f":"IF(J99=0,0,IF(J118>=I97,(G114-F114)*S114,0))","v":0},{"$f":"IF(J99=0,0,IF(J118<I97,(G114-J114)*L114,0))","v":0},{"$f":"IF(J99=0,0,G114*H97)","v":0},{"$f":"IF(J99>=1,0,IF(J99=0,(G114*L114)))","v":0},0.95,{"$f":"IF(N114=0,0,IF(Q99=0,0,(N114/N118)*I97))","v":0},0,{"$f":"IF(Q99=0,0,IF(Q118>=I97,(N114-M114)*S114,0))","v":0},{"$f":"IF(Q99=0,0,IF(Q118<I97,(N114-Q114)*S114,0))","v":0},{"$f":"IF(Q99=0,0,N114*H97)","v":0},{"$f":"IF(Q99>=1,0,IF(Q99=0,(N114*S114)))","v":0},0.95,{"$f":"IF(U114=0,0,IF(X99=0,0,(U114/U118)*I97))","v":0},0,{"$f":"IF(X99=0,0,IF(X118>=I97,(U114-T114)*Z114,0))","v":0},{"$f":"IF(X99=0,0,IF(X118<I97,(U114-X114)*Z114,0))","v":0},{"$f":"IF(X99=0,0,U114*H97)","v":0},{"$f":"IF(X99>=1,0,IF(X99=0,(U114*Z114)))","v":0},0.95,{"$f":"IF(AB114=0,0,IF(AE99=0,0,(AB114/AB118)*I97))","v":0},0,{"$f":"IF(AE99=0,0,IF(AE118>=I97,(AB114-AA114)*AG114,0))","v":0},{"$f":"IF(AE99=0,0,IF(AE118<I97,(AB114-AE114)*AG114,0))","v":0},{"$f":"IF(AE99=0,0,AB114*H97)","v":0},{"$f":"IF(AE99>=1,0,IF(AE99=0,(AB114*AG114)))","v":0},0.95]
[null,"f)",null,"Campo 412",null,{"$f":"IF(G115=0,0,IF(J99=0,0,(G115/G118)*I97))","v":0},{"$f":"P25","v":0},{"$f":"IF(J99=0,0,IF(J118>=I97,(G115-F115)*S115,0))","v":0},{"$f":"IF(J99=0,0,IF(J118<I97,(G115-J115)*L115,0))","v":0},{"$f":"IF(J99=0,0,G115*H97)","v":0},{"$f":"IF(J99>=1,0,IF(J99=0,(G115*L115)))","v":0},{"$f":"IF(F98>=1,10%,IF(I75=2,5%,IF(I75=3,7.5%,10%)))","v":0.1},{"$f":"IF(N115=0,0,IF(Q99=0,0,(N115/N118)*I97))","v":0},0,{"$f":"IF(Q99=0,0,IF(Q118>=I97,(N115-M115)*S115,0))","v":0},{"$f":"IF(Q99=0,0,IF(Q118<I97,(N115-Q115)*S115,0))","v":0},{"$f":"IF(Q99=0,0,N115*H97)","v":0},{"$f":"IF(Q99>=1,0,IF(Q99=0,(N115*S115)))","v":0},{"$f":"IF(M98>=1,10%,IF(L75=2,5%,IF(L75=3,7.5%,10%)))","v":0.1},{"$f":"IF(U115=0,0,IF(X99=0,0,(U115/U118)*I97))","v":0},0,{"$f":"IF(X99=0,0,IF(X118>=I97,(U115-T115)*Z115,0))","v":0},{"$f":"IF(X99=0,0,IF(X118<I97,(U115-X115)*Z115,0))","v":0},{"$f":"IF(X99=0,0,U115*H97)","v":0},{"$f":"IF(X99>=1,0,IF(X99=0,(U115*Z115)))","v":0},{"$f":"IF(T98>=1,10%,IF(O75=2,5%,IF(O75=3,7.5%,10%)))","v":0.1},{"$f":"IF(AB115=0,0,IF(AE99=0,0,(AB115/AB118)*I97))","v":0},0,{"$f":"IF(AE99=0,0,IF(AE118>=I97,(AB115-AA115)*AG115,0))","v":0},{"$f":"IF(AE99=0,0,IF(AE118<I97,(AB115-AE115)*AG115,0))","v":0},{"$f":"IF(AE99=0,0,AB115*H97)","v":0},{"$f":"IF(AE99>=1,0,IF(AE99=0,(AB115*AG115)))","v":0},{"$f":"IF(AA98>=1,10%,IF(R75=2,5%,IF(R75=3,7.5%,10%)))","v":0.1}]
[null,null,null,"Campo 413",null,{"$f":"IF(G116=0,0,IF(J99=0,0,(G116/G118)*I97))","v":0},{"$f":"P26","v":0},{"$f":"IF(J99=0,0,IF(J118>=I97,(G116-F116)*S116,0))","v":0},{"$f":"IF(J99=0,0,IF(J118<I97,(G116-J116)*L116,0))","v":0},{"$f":"IF(J99=0,0,G116*H97)","v":0},{"$f":"IF(J99>=1,0,IF(J99=0,(G116*L116)))","v":0},0.3,{"$f":"IF(N116=0,0,IF(Q99=0,0,(N116/N118)*I97))","v":0},0,{"$f":"IF(Q99=0,0,IF(Q118>=I97,(N116-M116)*S116,0))","v":0},{"$f":"IF(Q99=0,0,IF(Q118<I97,(N116-Q116)*S116,0))","v":0},{"$f":"IF(Q99=0,0,N116*H97)","v":0},{"$f":"IF(Q99>=1,0,IF(Q99=0,(N116*S116)))","v":0},{"$f":"L116","v":0.3},{"$f":"IF(U116=0,0,IF(X99=0,0,(U116/U118)*I97))","v":0},0,{"$f":"IF(X99=0,0,IF(X118>=I97,(U116-T116)*Z116,0))","v":0},{"$f":"IF(X99=0,0,IF(X118<I97,(U116-X116)*Z116,0))","v":0},{"$f":"IF(X99=0,0,U116*H97)","v":0},{"$f":"IF(X99>=1,0,IF(X99=0,(U116*Z116)))","v":0},{"$f":"S116","v":0.3},{"$f":"IF(AB116=0,0,IF(AE99=0,0,(AB116/AB118)*I97))","v":0},0,{"$f":"IF(AE99=0,0,IF(AE118>=I97,(AB116-AA116)*AG116,0))","v":0},{"$f":"IF(AE99=0,0,IF(AE118<I97,(AB116-AE116)*AG116,0))","v":0},{"$f":"IF(AE99=0,0,AB116*H97)","v":0},{"$f":"IF(AE99>=1,0,IF(AE99=0,(AB116*AG116)))","v":0},{"$f":"Z116","v":0.3}]
[null,null,null,"Campo 414",null,{"$f":"IF(G117=0,0,IF(J99=0,0,(G117/G118)*I97))","v":0},0,{"$f":"IF(J99=0,0,IF(J118>=I97,(G117-F117)*S117,0))","v":0},{"$f":"IF(J99=0,0,IF(J118<I97,(G117-J117)*L117,0))","v":0},{"$f":"IF(J99=0,0,G117*H97)","v":0},{"$f":"IF(J99>=1,0,IF(J99=0,(G117*L117)))","v":0},0.1,{"$f":"IF(N117=0,0,IF(Q99=0,0,(N117/N118)*I97))","v":0},0,{"$f":"IF(Q99=0,0,IF(Q118>=I97,(N117-M117)*S117,0))","v":0},{"$f":"IF(Q99=0,0,IF(Q118<I97,(N117-Q117)*S117,0))","v":0},{"$f":"IF(Q99=0,0,N117*H97)","v":0},{"$f":"IF(Q99>=1,0,IF(Q99=0,(N117*S117)))","v":0},{"$f":"L117","v":0.1},{"$f":"IF(U117=0,0,IF(X99=0,0,(U117/U118)*I97))","v":0},0,{"$f":"IF(X99=0,0,IF(X118>=I97,(U117-T117)*Z117,0))","v":0},{"$f":"IF(X99=0,0,IF(X118<I97,(U117-X117)*Z117,0))","v":0},{"$f":"IF(X99=0,0,U117*H97)","v":0},{"$f":"IF(X99>=1,0,IF(X99=0,(U117*Z117)))","v":0},{"$f":"S117","v":0.1},{"$f":"IF(AB117=0,0,IF(AE99=0,0,(AB117/AB118)*I97))","v":0},0,{"$f":"IF(AE99=0,0,IF(AE118>=I97,(AB117-AA117)*AG117,0))","v":0},{"$f":"IF(AE99=0,0,IF(AE118<I97,(AB117-AE117)*AG117,0))","v":0},{"$f":"IF(AE99=0,0,AB117*H97)","v":0},{"$f":"IF(AE99>=1,0,IF(AE99=0,(AB117*AG117)))","v":0},{"$f":"Z117","v":0.1}]
[null,"SOMA TOTAL→",null,null,null,null,{"$f":"SUM(G101:G117)","v":0},{"$f":"SUM(H101:I117,K101:K117)","v":0},null,{"$f":"SUM(J101:J117)","v":0},null,null,null,{"$f":"SUM(N101:N117)","v":0},{"$f":"SUM(O101:P117,R101:R117)","v":0},null,{"$f":"SUM(Q101:Q117)","v":0},null,null,null,{"$f":"SUM(U101:U117)","v":0},{"$f":"SUM(V101:W116,Y101:Y117)","v":0},null,{"$f":"SUM(X101:X117)","v":0},null,null,null,{"$f":"SUM(AB101:AB117)","v":0},{"$f":"SUM(AC101:AD116,AF101:AF117)","v":0},null,{"$f":"SUM(AE101:AE117)","v":0}]
[null,"PROPRIEDADE INTELECTUAL"]
[null,{"$f":"B20","v":"Propriedade intelectual (não abrangida pelo art.º 58.º do EBF), industrial ou de prestação de informações"}]
[null,"Limites →",null,0.5,10000,{"$f":"IF(P20*D121<E121,P20*D121,IF(P20*D121>=E121,E121,))","v":0},null,null,null,null,null,null,{"$f":"IF(R20*D121<E121,R20*D121,IF(R20*D121>=E121,E121,))","v":0},null,null,null,null,null,null,{"$f":"IF(T20*D121<E121,T20*D121,IF(T20*D121>=E121,E121,))","v":0},null,null,null,null,null,null,{"$f":"IF(V20*D121<E121,V20*D121,IF(V20*D121>=E121,E121,))","v":0}]
[null,"Prop. Intelectual →",null,null,null,{"$f":"IF(C87=2,P20-F121,P20)","v":0},null,null,null,null,null,null,{"$f":"IF(F87=2,R20-M121,R20)","v":0},null,null,null,null,null,null,{"$f":"IF(I87=2,T20-T121,T20)","v":0},null,null,null,null,null,null,{"$f":"IF(L87=2,V20-AA121,V20)","v":0}]
[null,"Continente (RB)",null,"SOMA",{"$f":"SUM(H118+O118+V118+AC118)","v":0},{"$f":"IF(X123=1,E123,)","v":0},null,null,"T. Separado",null,null,null,null,null,null,null,null,null,null,null,null,null,{"$f":"'Anexo A'!X253","v":1},{"$f":"IF(X124=TRUE,4,IF(X125=TRUE,4,IF(X126=TRUE,1,'Anexo A'!S46)))","v":1}]
[null,"Açores ",null,"SOMA",{"$f":"IF(E123<0,0,E123)","v":0},{"$f":"IF(X123=2,G464,)","v":0},null,"SP A→",{"$f":"IF(X123>=4,0,IF(W123=1,F96+T96+AA96,))","v":0},null,null,null,null,null,null,null,null,null,null,null,null,null,null,{"$f":"'Modelo 3'!D43","v":0}]
[null,"Madeira",null,"SOMA",{"$f":"IF(E123<0,0,E123)","v":0},{"$f":"IF(X123=3,E125,)","v":0},null,"SP B→",{"$f":"IF(X123>=4,0,IF(W123=1,M96+T96+AA96,))","v":0},null,null,null,null,null,null,null,null,null,null,null,null,null,null,{"$f":"'Modelo 3'!E43","v":0}]
[null,{"$f":"IF(E123<0,0,SUM(F123+F124+F125))","v":0},null,"← Rendimento bruto",null,null,null,null,null,null,null,null,null,null,null,null,null,null,null,null,null,null,null,{"$f":"'Modelo 3'!F43","v":0}]
[]
[null,"Art.º 31.º n.º 13 do CIRS - Categoria B Profissionais Liberais e Alojamento Local",null,null,null,null,null,null,null,null,null,null,{"$f":"D130+171","v":4275},{"$f":"IF(F135>D131,M128-D130,)","v":0},"Despesas ↓",null,"Capmo 403","Campo 417","Q,Profissionais"]
[null,"T.  Separada →",null,null,null,{"$f":"IF(S139=1,F136,0)","v":0},null,{"$f":"IF(S139=1,H136,0)","v":0},null,{"$f":"IF(S139=1,J136/2,0)","v":0},null,{"$f":"IF(S139=1,L136/2,0)","v":0}]
[null,"Ded. específica →",null,{"$f":"'Modelo 3'!J36","v":4104},null,{"$f":"N130","v":4104},null,{"$f":"N132","v":4104},null,{"$f":"N134","v":4104},null,{"$f":"N136+N137","v":4104},null,{"$f":"IF(P62+P63>=D130,P62+P63,D130)","v":4104},"SP A",{"$f":"IF(F135<D131,0,IF(F135,F135*E131-F130))","v":0},{"$f":"P16","v":0},{"$f":"P14","v":0},{"$f":"IF(P64>=N128,N128,P64)","v":0}]
[null,"Limites →",null,{"$f":"D130/E131","v":27360},{"$f":"15%","v":0.15},{"$f":"I97","v":2500},null,null,null,null,null,null,null,null,null,{"$f":"IF(P130<=0,0,P130)","v":0},{"$f":"IF(Q130>=D131,0,IF(Q130<=D131,1,))","v":1},{"$f":"IF(R130>=D131,0,IF(R130<=D131,1,))","v":1}]
[null,null,null,null,null,"Sujeito Passivo A ",null,"Sujeito Passivo B",null,"Dependente  1",null,"Dependente  2",null,{"$f":"IF(R62+R63>=D130,R62+R63,D130)","v":4104},"SP B",{"$f":"IF(H135<D131,0,IF(H135,H135*E131-H130))","v":0},{"$f":"R16","v":0},{"$f":"R14","v":0},{"$f":"IF(R64>=N128,N128,R64)","v":0}]
[null,null,null,"PL Campo 403 →",null,{"$f":"P16","v":0},{"$f":"L107","v":0.75},{"$f":"R16","v":0},{"$f":"S107","v":0.75},{"$f":"T16","v":0},{"$f":"Z107","v":0.75},{"$f":"V16","v":0},{"$f":"AG107","v":0.75},null,null,{"$f":"IF(P132<=0,0,P132)","v":0},{"$f":"IF(Q132>=D131,0,IF(Q132<=D131,1,))","v":1},{"$f":"IF(R132>=D131,0,IF(R132<=D131,1,))","v":1}]
[null,null,null,"AL Campo 417 →",null,{"$f":"P14","v":0},{"$f":"L109","v":0.35},{"$f":"R14","v":0},{"$f":"S109","v":0.35},{"$f":"T14","v":0},{"$f":"Z109","v":0.35},{"$f":"V14","v":0},{"$f":"AG109","v":0.35},{"$f":"IF(T62+T63>=D130,T62+T63,D130)","v":4104},"Dep. 1",{"$f":"IF(J135<D131,0,IF(J135,J135*E131-J130))","v":0},{"$f":"T16","v":0},{"$f":"T14","v":0},{"$f":"IF(T64>=N128,N128,T64)","v":0}]
[null,"Rendimento Bruto →",null,null,null,{"$f":"IF(F133+F134<=D131,0,IF(O83=4,0,(F133+F134)-G139-G140))","v":0},null,{"$f":"IF(H133+H134<=D131,0,IF(R83=4,0,(H133+H134)-I139-I140))","v":0},null,{"$f":"IF(J133+J134<=D131,0,IF(U83=4,0,(J133+J134)-K139-K140))","v":0},null,{"$f":"IF(L133+L134<=D131,0,IF(X83=4,0,(L133+L134)-M139-S87))","v":0},null,null,null,{"$f":"IF(P134<=0,0,P134)","v":0},{"$f":"IF(Q134>=D131,0,IF(Q134<=D131,1,))","v":1},{"$f":"IF(R134>=D131,0,IF(R134<=D131,1,))","v":1}]
[null,null,null,"SOMA TOTAL→",null,{"$f":"IF(F135<=0,0,F138+G138)","v":0},{"$f":"(F133-G139)*G133","v":0},{"$f":"IF(H135<=0,0,H138+I138)","v":0},{"$f":"(H133-I139)*I133","v":0},{"$f":"IF(J135<=0,0,J138+K138)","v":0},{"$f":"(J133-K139)*K133","v":0},{"$f":"IF(L135<=0,0,L138+M138)","v":0},{"$f":"(L133-M139)*M133","v":0},{"$f":"IF(V62+V63>=D130,V62+V63,D130)","v":4104},"Dep. 2",{"$f":"IF(L135<D131,0,IF(L135,L135*E131-L130))","v":0},{"$f":"V16","v":0},{"$f":"V14","v":0},{"$f":"IF(V64>=N128,N128,V64)","v":0}]
[null,null,null,"D. regist linha 93 →",null,{"$f":"P65+S130","v":0},{"$f":"(F134-G140)*G134","v":0},{"$f":"R65+S132","v":0},{"$f":"(H134-I140)*I134","v":0},{"$f":"T65+S134","v":0},{"$f":"(J134-K140)*K134","v":0},{"$f":"V65+S136","v":0},{"$f":"(L134-M140)*M134","v":0},null,null,{"$f":"IF(P136<=0,0,P136)","v":0},{"$f":"IF(Q136>=D131,0,IF(Q136<=D131,1,))","v":1},{"$f":"IF(R136>=D131,0,IF(R136<=D131,1,))","v":1}]
[null,null,"SOMA →","Desp. a justificar →",null,{"$f":"IF(P131>=F137,P131-F137,IF(P131>=F137,F137,))","v":0},{"$f":"SUM(G136:G137)","v":0},{"$f":"IF(P133>=H137,P133-H137,IF(P133>=H137,H137,))","v":0},{"$f":"SUM(I136:I137)","v":0},{"$f":"IF(P135>=J137,P135-J137,IF(P135>=J137,J137,))","v":0},{"$f":"SUM(K136:K137)","v":0},{"$f":"IF(P137>=L137,P137-L137,IF(P137>=L137,L137,))","v":0},{"$f":"SUM(M136:M137)","v":0}]
[null,"Deficientes →",null,"Campo 403→",null,{"$f":"IF(F141>1,(G141/F141)*F131,0)","v":0},{"$f":"IF(F139>=F131,F131,F139)","v":0},{"$f":"IF(H141>1,(I141/H141)*F131,0)","v":0},{"$f":"IF(H139>=F131,F131,H139)","v":0},{"$f":"IF(J141>1,(K141/J141)*I97,0)","v":0},{"$f":"IF(J139>=F131,F131,J139)","v":0},{"$f":"IF(L141>1,(M141/L141)*I97,0)","v":0},{"$f":"IF(L139>=F131,F131,L139)","v":0},null,null,null,null,null,{"$f":"'Anexo A'!X253","v":1},{"$f":"IF(T140=TRUE,4,IF(T141=TRUE,4,IF(T142=TRUE,1,'Anexo A'!S46)))","v":1}]
[null,null,null,"Alojamento Local→",null,{"$f":"IF(F141>1,(G142/F141)*F131,0)","v":0},{"$f":"IF(F140>=F131,F131,F140)","v":0},{"$f":"IF(H141>1,(I142/H141)*F131,0)","v":0},{"$f":"IF(H140>=F131,F131,H140)","v":0},{"$f":"IF(J141>1,(K142/J141)*I97,0)","v":0},{"$f":"IF(J140>=I97,I97,J140)","v":0},{"$f":"IF(L141>1,(M142/L141)*I97,0)","v":0},{"$f":"IF(L140>=F131,F131,L140)","v":0},null,null,null,null,null,null,{"$f":"'Modelo 3'!D43","v":0}]
[null,null,null,null,null,{"$f":"SUM(G141:G142)","v":0},{"$f":"IF(J99=1,P16,0)","v":0},{"$f":"SUM(I141:I142)","v":0},{"$f":"IF(J99=1,R16,0)","v":0},{"$f":"SUM(K141:K142)","v":0},{"$f":"IF(J99=1,T16,0)","v":0},{"$f":"SUM(M141:M142)","v":0},{"$f":"IF(J99=1,V16,0)","v":0},null,null,null,null,null,null,{"$f":"'Modelo 3'!E43","v":0}]
[null,null,null,null,null,null,{"$f":"IF(J99=1,P14,0)","v":0},null,{"$f":"IF(J99=1,R14,0)","v":0},null,{"$f":"IF(J99=1,T14,0)","v":0},null,{"$f":"IF(J99=1,V14,0)","v":0},null,null,null,null,null,null,{"$f":"'Modelo 3'!F43","v":0}]
[null,"Continente (RB)",null,"SOMA",{"$f":"SUM(F136+H136+J136+L136)","v":0},{"$f":"IF(T139=1,E143,)","v":0},null,null,"T. Separado"]
[null,"Açores ",null,"SOMA",{"$f":"IF(E143<0,0,E143)","v":0},{"$f":"IF(T139=2,E144,)","v":0},null,"SP A→",{"$f":"IF(T139>=4,0,IF(S139=1,F129+J129+L129,))","v":0}]
[null,"Madeira",null,"SOMA",{"$f":"IF(E143<0,0,E143)","v":0},{"$f":"IF(T139=3,E145,)","v":0},null,"SP B→",{"$f":"IF(T139>=4,0,IF(S139=1,H129+J129+L129,))","v":0}]
[null,{"$f":"IF(E143<0,0,SUM(F143:G145))","v":0},null,"← Rendimento bruto"]
[]
[null,"Art.º 31.º do CIRS - Regime simplificado - Descontos obrigatorios para a S. Social",null,null,null,null,null,null,null,null,null,null,null,null,null,null,null,null,{"$f":"'Anexo A'!X253","v":1},{"$f":"IF(T149=TRUE,4,IF(T150=TRUE,4,IF(T151=TRUE,1,'Anexo A'!S46)))","v":1}]
[null,"T.  Separada →",null,{"$f":"IF(S148=1,D158,0)","v":0},null,{"$f":"IF(S148=1,F158,0)","v":0},null,{"$f":"IF(S148=1,H158/2,0)","v":0},null,{"$f":"IF(S148=1,J158/2,0)","v":0},null,null,null,null,null,null,null,null,null,{"$f":"'Modelo 3'!D43","v":0}]
[null,"Rendimento Bruto →",null,{"$f":"G107+G109+G111+E173+E175+E177","v":0},null,{"$f":"N107+N109+N111+L173+L175+L177","v":0},null,{"$f":"U107+U109+U111","v":0},null,{"$f":"AB107+AB109+AB111","v":0},null,null,null,null,null,null,null,null,null,{"$f":"'Modelo 3'!E43","v":0}]
[null,"Taxa →",null,0.1,0.35,0.75,null,null,null,null,null,null,null,null,0.35,{"$f":"'Modelo 3'!S36","v":0.25},null,null,{"$f":"SUM(T10:U18,V10:W18,T20:U31,V20:W31)/2","v":0},{"$f":"'Modelo 3'!F43","v":0}]
[null,"Campos",null,"Sujeito Passivo A ",null,"Sujeito Passivo B",null,"Dependente  1",null,"Dependente  2"]
[null,"Campos 403,404,408,452,455,458 b)",null,{"$f":"IF(D150<1,0,P36+P55)","v":0},null,{"$f":"IF(F150<1,0,R36+R55)","v":0},null,{"$f":"IF(H150<1,0,T36)","v":0},null,{"$f":"IF(J150<1,0,V36)","v":0}]
[null,"Campos 403,404,408,452,455,458 c)",null,{"$f":"P16*F151","v":0},null,{"$f":"R16*F151","v":0},null,{"$f":"T16*F151","v":0},null,{"$f":"V16*F151","v":0}]
[null,null,null,{"$f":"P18*E151","v":0},null,{"$f":"R18*E151","v":0},null,{"$f":"T18*E151","v":0},null,{"$f":"V18*E151","v":0}]
[null,null,"SOMA",{"$f":"SUM(D154:D155)","v":0},null,{"$f":"SUM(F154:F155)","v":0},null,{"$f":"SUM(H154:H155)","v":0},null,{"$f":"SUM(J154:J155)","v":0}]
[null,null,null,{"$f":"D153-(D150*D151)","v":0},null,{"$f":"F153-(F150*D151)","v":0},null,{"$f":"H153-(H150*D151)","v":0},null,{"$f":"J153-(J150*D151)","v":0},null,null,null,null,null,null,null,"Tributação Autónoma"]
[null,"SOMA TOTAL→",null,{"$f":"IF(D157<0,0,IF(D157>D156,D156,D157))","v":0},null,{"$f":"IF(F157<0,0,IF(F157>F156,F156,F157))","v":0},null,{"$f":"IF(H157<0,0,IF(H157>H156,H156,H157))","v":0},null,{"$f":"IF(J157<0,0,IF(J157>J156,J156,J157))","v":0}]
[null,"Continente (DE)",null,"SOMA",{"$f":"SUM(D158:K158)","v":0},{"$f":"IF(T148=1,E159,)","v":0},null,null,"T. Separado",null,null,null,null,null,null,null,"Não residentes"]
[null,"Açores ",null,"SOMA",{"$f":"IF(E159<0,0,E159)","v":0},{"$f":"IF(T148=2,E160,)","v":0},null,"SP A→",{"$f":"IF(T148>=4,0,IF(S148=1,D149+H149+J149,))","v":0},null,null,null,null,null,null,"SP A→",{"$f":"IF(T148>=4,T160,)","v":0},null,{"$f":"SUM(P10:Q18,P20:Q27,P42:Q48)+S151","v":0},{"$f":"IF(U75=2,S160*O151*P151,IF(U75=1,S160*P151,IF(U75=3,S160*P151)))","v":0}]
[null,"Madeira",null,"SOMA",{"$f":"IF(E159<0,0,E159)","v":0},{"$f":"IF(T148=3,E161,)","v":0},null,"SP B→",{"$f":"IF(T148>=4,0,IF(S148=1,F149+H149+J149,))","v":0},null,null,null,null,null,null,"SP B→",{"$f":"IF(T148>=4,T161,)","v":0},null,{"$f":"SUM(R10:S18,R20:S27,R42:S51)+S151","v":0},{"$f":"IF(U75=2,S161*O151*P151,IF(U75=1,S161*P151,IF(U75=3,S161*P151)))","v":0}]
[null,{"$f":"IF(E159<0,0,SUM(F159+F160+F161))","v":0},null,"← Dedução específica"]
[]
[null,"Artigos 3.º e 4.º  do CIRS - Rendimentos Agrícolas, Silvícolas e Pecuárias",null,null,null,null,null,null,null,null,null,null,null,"SP A",{"$f":"'Anexo A'!O7+'Anexo A'!O22+'Anexo A'!O23+'Anexo A'!O24+'Anexo A'!O26+'Anexo E'!P8+'Anexo E'!P18+'Anexo F'!Q9+'Anexo F'!Q10+'Anexo G'!P8+'Anexo G'!P27","v":0},null,null,null,{"$f":"'Anexo A'!X253","v":1},{"$f":"IF(T165=TRUE,4,IF(T166=TRUE,4,IF(T167=TRUE,1,'Anexo A'!S46)))","v":1}]
[null,"T.  Separada →",null,{"$f":"IF(S164=1,F178,0)","v":0},null,null,null,null,null,null,{"$f":"IF(S164=1,M178,0)","v":0},null,null,"SP B",{"$f":"'Anexo A'!Q7+'Anexo A'!Q22+'Anexo A'!Q23+'Anexo A'!Q24+'Anexo A'!Q26+'Anexo E'!R8+'Anexo E'!R18+'Anexo F'!S9+'Anexo F'!S10+'Anexo G'!R8+'Anexo G'!R27","v":0},null,null,null,null,{"$f":"'Modelo 3'!D43","v":0}]
[null,"Isenção ato isolado →",null,{"$f":"D97","v":1715.6},null,{"$f":"G97","v":"Limites →"},{"$f":"H97","v":0.15},{"$f":"I97","v":2500},null,null,null,null,null,null,null,null,null,null,null,{"$f":"'Modelo 3'!E43","v":0}]
[null,"Isento até →",null,{"$f":"E167*F167*G167","v":23160.6},4.5,{"$f":"'Modelo 3'!G36","v":428.9},12,null,null,null,null,null,null,null,null,null,null,null,null,{"$f":"'Modelo 3'!F43","v":0}]
[null,"Soma Cat.A,B,E,F,G,H →",null,null,{"$f":"SUM(P10:Q18,P20:Q27,P42:Q48)+O164","v":0},null,null,null,null,null,null,{"$f":"SUM(R10:S18,R20:S27,R42:S48)+O165","v":0}]
[null,null,null,"Sujeito Passivo A ",null,"Rendimento dos dedeficientes ↓",null,{"$f":"'Modelo 3'!H20+'Modelo 3'!H21+'Modelo 3'!H22+'Modelo 3'!H23","v":0},null,null,"Sujeito Passivo B ",null,"Rendimento dos dedeficientes ↓",null,{"$f":"'Modelo 3'!I20+'Modelo 3'!I21+'Modelo 3'!I22+'Modelo 3'!I23","v":0}]
[null,"Campos",null,"Rendimento Bruto ↓",null," ≥ 2500","   < 2500","SP A","N/Defi.","Taxa","Rendimento Bruto ↓",null," ≥ 2500","   < 2500","SP A","N/Defi.","Taxa"]
[null,"Ato isolado 451 →",null,{"$f":"IF(E168=0,0,IF(H169=0,0,(E171/E178*H166)))","v":0},{"$f":"IF(P42<=D166,0,IF(E168>D167,P42,0))","v":0},{"$f":"IF(H169=0,0,IF(H178>=H166,(E171-D171)*J171,0))","v":0},{"$f":"IF(H169=0,0,IF(H178<H166,(E171-H171)*J171,0))","v":0},{"$f":"IF(H169=0,0,E171*G166)","v":0},{"$f":"IF(H169>=1,0,IF(H169=0,(E171*J171)))","v":0},0.15,{"$f":"IF(L168=0,0,IF(O169=0,0,(L171/L178*H166)))","v":0},{"$f":"IF(R42<=D166,0,IF(L168>D167,R42,0))","v":0},{"$f":"IF(O169=0,0,IF(O178>=H166,(L171-K171)*Q171,0))","v":0},{"$f":"IF(O169=0,0,IF(O178<H166,(L171-O171)*Q171,0))","v":0},{"$f":"IF(O169=0,0,L171*G166)","v":0},{"$f":"IF(O169>=1,0,IF(O169=0,(L171*Q171)))","v":0},{"$f":"J171","v":0.15}]
[null,"Campo 451 →","Campo 451",{"$f":"IF(E168=0,0,IF(H169=0,0,(E172/E178*H166)))","v":0},{"$f":"IF(E168>D167,P43,0)","v":0},{"$f":"IF(H169=0,0,IF(H178>=H166,(E172-D172)*J172,0))","v":0},{"$f":"IF(H169=0,0,IF(H178<H166,(E172-H172)*J172,0))","v":0},{"$f":"IF(H169=0,0,E172*G166)","v":0},{"$f":"IF(H169>=1,0,IF(H169=0,(E172*J172)))","v":0},0.15,{"$f":"IF(L168=0,0,IF(O169=0,0,(L172/L178*H166)))","v":0},{"$f":"IF(L168>D167,R43,0)","v":0},{"$f":"IF(O169=0,0,IF(O178>=H166,(L172-K172)*Q172,0))","v":0},{"$f":"IF(O169=0,0,IF(O178<H166,(L172-O172)*Q172,0))","v":0},{"$f":"IF(L172=0,0,L171*G166)","v":0},{"$f":"IF(O169>=1,0,IF(O169=0,(L172*Q172)))","v":0},{"$f":"J172","v":0.15}]
[null,"Ato isolado 452 →",null,{"$f":"IF(E168=0,0,IF(H169=0,0,(E173/E178*H166)))","v":0},{"$f":"IF(P44<=D166,0,IF(E168>D167,P44,0))","v":0},{"$f":"IF(H169=0,0,IF(H178>=H166,(E173-D173)*J173,0))","v":0},{"$f":"IF(H169=0,0,IF(H178<H166,(E173-H173)*J173,0))","v":0},{"$f":"IF(H169=0,0,E173*G166)","v":0},{"$f":"IF(H169>=1,0,IF(H169=0,(E173*J173)))","v":0},0.35,{"$f":"IF(L168=0,0,IF(O169=0,0,(L173/L178*H166)))","v":0},{"$f":"IF(R44<=D166,0,IF(L168>D167,R44,0))","v":0},{"$f":"IF(O169=0,0,IF(O178>=H166,(L173-K173)*Q173,0))","v":0},{"$f":"IF(O169=0,0,IF(O178<H166,(L173-O173)*Q173,0))","v":0},{"$f":"IF(O169=0,0,L173*G166)","v":0},{"$f":"IF(O169>=1,0,IF(O169=0,(L173*Q173)))","v":0},{"$f":"J173","v":0.35}]
[null,"Campo 452 b) →",null,{"$f":"IF(E168=0,0,IF(H169=0,0,(E174/E178*H166)))","v":0},{"$f":"IF(E168>D167,P45,0)","v":0},{"$f":"IF(H169=0,0,IF(H178>=H166,(E174-D174)*J174,0))","v":0},{"$f":"IF(H169=0,0,IF(H178<H166,(E174-H174)*J174,0))","v":0},{"$f":"IF(H169=0,0,E174*G166)","v":0},{"$f":"IF(H169>=1,0,IF(H169=0,(E174*J174)))","v":0},{"$f":"IF(F98>=1,35%,IF(I75=2,17.5%,IF(I75=3,26.25%,35%)))","v":0.35},{"$f":"IF(L168=0,0,IF(O169=0,0,(L174/L178*H166)))","v":0},{"$f":"IF(L168>D167,R45,0)","v":0},{"$f":"IF(O169=0,0,IF(O178>=H166,(L174-K174)*Q174,0))","v":0},{"$f":"IF(O169=0,0,IF(O178<H166,(L174-O174)*Q174,0))","v":0},{"$f":"IF(O169=0,0,L174*G166)","v":0},{"$f":"IF(O169>=1,0,IF(O169=0,(L174*Q174)))","v":0},{"$f":"IF(M98>=1,35%,IF(L75=2,17.5%,IF(L75=3,26.25%,35%)))","v":0.35}]
[null,"Campo 455 f) →",null,{"$f":"IF(E168=0,0,IF(H169=0,0,(E175/E178*H166)))","v":0},{"$f":"IF(E168>D167,P46,0)","v":0},{"$f":"IF(H169=0,0,IF(H178>=H166,(E175-D175)*J175,0))","v":0},{"$f":"IF(H169=0,0,IF(H178<H166,(E175-H175)*J175,0))","v":0},{"$f":"IF(H169=0,0,E175*G166)","v":0},{"$f":"IF(H169>=1,0,IF(H169=0,(E175*J175)))","v":0},{"$f":"IF(F98>=1,10%,IF(I75=2,5%,IF(I75=3,7.5%,10%)))","v":0.1},{"$f":"IF(L168=0,0,IF(O169=0,0,(L175/L178*H166)))","v":0},{"$f":"IF(L168>D167,R46,0)","v":0},{"$f":"IF(O169=0,0,IF(O178>=H166,(L175-K175)*Q175,0))","v":0},{"$f":"IF(O169=0,0,IF(O178<H166,(L175-O175)*Q175,0))","v":0},{"$f":"IF(O169=0,0,L175*G166)","v":0},{"$f":"IF(O169>=1,0,IF(O169=0,(L175*Q175)))","v":0},{"$f":"IF(M98>=1,10%,IF(L75=2,5%,IF(L75=3,7.5%,10%)))","v":0.1}]
[null,"Campo 456  →",null,{"$f":"IF(E168=0,0,IF(H169=0,0,(E176/E178*H166)))","v":0},{"$f":"IF(E168>D167,P47,0)","v":0},{"$f":"IF(H169=0,0,IF(H178>=H166,(E176-D176)*J176,0))","v":0},{"$f":"IF(H169=0,0,IF(H178<H166,(E176-H176)*J176,0))","v":0},{"$f":"IF(H169=0,0,E176*G166)","v":0},{"$f":"IF(H169>=1,0,IF(H169=0,(E176*J176)))","v":0},0.3,{"$f":"IF(L168=0,0,IF(O169=0,0,(L176/L178*H166)))","v":0},{"$f":"IF(L168>D167,R47,0)","v":0},{"$f":"IF(O169=0,0,IF(O178>=H166,(L176-K176)*Q176,0))","v":0},{"$f":"IF(O169=0,0,IF(O178<H166,(L176-O176)*Q176,0))","v":0},{"$f":"IF(O169=0,0,L176*G166)","v":0},{"$f":"IF(O169>=1,0,IF(O169=0,(L176*Q176)))","v":0},{"$f":"J176","v":0.3}]
[null,"Campo 458  →",null,{"$f":"IF(E168=0,0,IF(H169=0,0,(E177/E178*H166)))","v":0},{"$f":"IF(E168>D167,P48,0)","v":0},{"$f":"IF(H169=0,0,IF(H178>=H166,(E177-D177)*J177,0))","v":0},{"$f":"IF(H169=0,0,IF(H178<H166,(E177-H177)*J177,0))","v":0},{"$f":"IF(H169=0,0,E177*G166)","v":0},{"$f":"IF(H169>=1,0,IF(H169=0,(E177*J177)))","v":0},0.1,{"$f":"IF(L168=0,0,IF(O169=0,0,(L177/L178*H166)))","v":0},{"$f":"IF(L168>D167,R48,0)","v":0},{"$f":"IF(O169=0,0,IF(O178>=H166,(L177-K177)*Q177,0))","v":0},{"$f":"IF(O169=0,0,IF(O178<H166,(L177-O177)*Q177,0))","v":0},{"$f":"IF(O169=0,0,L177*G166)","v":0},{"$f":"IF(O169>=1,0,IF(O169=0,(L177*Q177)))","v":0},{"$f":"J177","v":0.1}]
[null,"SOMA TOTAL→",null,null,{"$f":"SUM(E171:E177)","v":0},{"$f":"SUM(F171:G177,I171:I177)","v":0},null,{"$f":"SUM(H171:H177)","v":0},null,null,null,{"$f":"SUM(L171:L177)","v":0},{"$f":"SUM(M171:N177,P171:P177)","v":0},null,{"$f":"SUM(O171:O177)","v":0}]
[null,"Continente (RB)",null,"SOMA",{"$f":"SUM(F178+M178)","v":0},{"$f":"IF(T164=1,E179,)","v":0},null,null,"T. Separado"]
[null,"Açores ",null,"SOMA",{"$f":"IF(E179<0,0,E179)","v":0},{"$f":"IF(T164=2,E180,)","v":0},null,"SP A→",{"$f":"IF(T164>=4,0,IF(S164=1,D165,))","v":0}]
[null,"Madeira",null,"SOMA",{"$f":"IF(E179<0,0,E179)","v":0},{"$f":"IF(T164=3,E181,)","v":0},null,"SP B→",{"$f":"IF(T164>=4,0,IF(S164=1,K165,))","v":0}]
[null,{"$f":"IF(E179<0,0,SUM(F179:G181))","v":0},null,"← Rendimento bruto"]
[]
[null,"Reporte de prejuízos da categoria B - Prazo 12 anos",null,null,null,null,null,null,null,null,null,null,null,null,null,null,null,null,{"$f":"'Anexo A'!X253","v":1},{"$f":"IF(T185=TRUE,4,IF(T186=TRUE,4,IF(T187=TRUE,1,'Anexo A'!S46)))","v":1}]
[null,"T.  Separada →",null,{"$f":"IF(S184=1,D188,0)","v":0},null,{"$f":"IF(S184=1,F188,0)","v":0},null,{"$f":"IF(S184=1,H188/2,0)","v":0},null,{"$f":"IF(S184=1,J188/2,0)","v":0},null,null,null,null,null,null,null,null,null,{"$f":"'Modelo 3'!D43","v":0}]
[null,"Rendimento Bruto →",null,{"$f":"IF(B126+B146+B182>1,P32+P51,0)","v":0},null,{"$f":"IF(B126+B146+B182>1,R32+R51,0)","v":0},null,{"$f":"IF(B126+B146+B182>1,T32,0)","v":0},null,{"$f":"IF(B126+B146+B182>1,V32,0)","v":0},null,null,null,null,null,null,null,null,null,{"$f":"'Modelo 3'!E43","v":0}]
[null,null,null,"Sujeito Passivo A ",null,"Sujeito Passivo B",null,"Dependente  1",null,"Dependente  2",null,null,null,null,null,null,null,null,null,{"$f":"'Modelo 3'!F43","v":0}]
[null,"SOMA TOTAL →",null,{"$f":"IF(D186>E188,E188,D186)","v":0},{"$f":"H118+F136+F178","v":0},{"$f":"IF(F186>G188,G188,F186)","v":0},{"$f":"O118+H136+M178","v":0},{"$f":"IF(H186>I188,I188,H186)","v":0},{"$f":"V118+J136","v":0},{"$f":"IF(J186>K188,K188,J186)","v":0},{"$f":"AC118+L136","v":0}]
[null,"Continente (RP)",null,"SOMA",{"$f":"SUM(D188+F188+H188+J188)","v":0},{"$f":"IF(T184=1,E189,)","v":0},null,null,"T. Separado"]
[null,"Açores ",null,"SOMA",{"$f":"IF(E189<0,0,E189)","v":0},{"$f":"IF(T184=2,E190,)","v":0},null,"SP A→",{"$f":"IF(T184>=4,0,IF(S184=1,D185+H185+J185,))","v":0}]
[null,"Madeira",null,"SOMA",{"$f":"IF(E189<0,0,E189)","v":0},{"$f":"IF(T184=3,E191,)","v":0},null,"SP B→",{"$f":"IF(T184>=4,0,IF(S184=1,F185+H185+J185,))","v":0}]
[null,{"$f":"IF(E189<0,0,SUM(F189+F190+F191))","v":0},null,"← Reporte de Prejuízos Fiscais"]
[]
[null,"Retenção na fonte da categoria B ",null,null,null,null,null,null,null,null,null,null,null,null,null,null,null,null,{"$f":"'Anexo A'!X253","v":1},{"$f":"IF(T195=TRUE,4,IF(T196=TRUE,4,IF(T197=TRUE,1,'Anexo A'!S46)))","v":1}]
[null,"T.  Separada →",null,{"$f":"IF(S194=1,D198,0)","v":0},null,{"$f":"IF(S194=1,F198,0)","v":0},null,{"$f":"IF(S194=1,H198/2,0)","v":0},null,{"$f":"IF(S194=1,J198/2,0)","v":0},null,null,null,null,null,null,null,null,null,{"$f":"'Modelo 3'!D43","v":0}]
[null,"Rendimento Bruto →",null,{"$f":"SUM(P28+P49)","v":0},null,{"$f":"SUM(R28+R49)","v":0},null,{"$f":"SUM(T28)","v":0},null,{"$f":"SUM(V28)","v":0},null,null,null,null,null,null,null,null,null,{"$f":"'Modelo 3'!E43","v":0}]
[null,null,null,"Sujeito Passivo A ",null,"Sujeito Passivo B",null,"Dependente  1",null,"Dependente  2",null,null,null,null,null,null,null,null,null,{"$f":"'Modelo 3'!F43","v":0}]
[null,"SOMA TOTAL →",null,{"$f":"D196","v":0},null,{"$f":"F196","v":0},null,{"$f":"H196","v":0},null,{"$f":"J196","v":0}]
[null,"Continente (RF)",null,"SOMA",{"$f":"SUM(D198:K198)","v":0},{"$f":"IF(T194=1,E199,)","v":0},null,null,"T. Separado",null,null,"Não residentes",null,{"$f":"SUM(T28:W28,)/2","v":0}]
[null,"Açores ",null,"SOMA",{"$f":"IF(E199<0,0,E199)","v":0},{"$f":"IF(T194=2,E200,)","v":0},null,"SP A→",{"$f":"IF(T194>=4,0,IF(S194=1,D195+H195+J195,))","v":0},null,"SP A→",{"$f":"IF(T194>=4,N200,)","v":0},null,{"$f":"SUM(P28+P49)+N199","v":0}]
[null,"Madeira",null,"SOMA",{"$f":"IF(E199<0,0,E199)","v":0},{"$f":"IF(T194=3,E201,)","v":0},null,"SP B→",{"$f":"IF(T194>=4,0,IF(S194=1,F195+H195+J195,))","v":0},null,"SP B→",{"$f":"IF(T194>=4,N201,)","v":0},null,{"$f":"SUM(R28+R49)+N199","v":0}]
[null,{"$f":"IF(E199<0,0,SUM(F199+F200+F201))","v":0},null,"← Retenção na Fonte"]
[]
[null,"Pagamentos por Conta categoria B ",null,null,null,null,null,null,null,null,null,null,null,null,null,null,null,null,{"$f":"'Anexo A'!X253","v":1},{"$f":"IF(T205=TRUE,4,IF(T206=TRUE,4,IF(T207=TRUE,1,'Anexo A'!S46)))","v":1}]
[null,"T.  Separada →",null,{"$f":"IF(S204=1,D208,0)","v":0},null,{"$f":"IF(S204=1,F208,0)","v":0},null,{"$f":"IF(S204=1,H208/2,0)","v":0},null,{"$f":"IF(S204=1,J208/2,0)","v":0},null,null,null,null,null,null,null,null,null,{"$f":"'Modelo 3'!D43","v":0}]
[null,"Rendimento Bruto →",null,{"$f":"SUM(P29+P50)","v":0},null,{"$f":"SUM(R29+R50)","v":0},null,{"$f":"SUM(T29)","v":0},null,{"$f":"SUM(V29)","v":0},null,null,null,null,null,null,null,null,null,{"$f":"'Modelo 3'!E43","v":0}]
[null,null,null,"Sujeito Passivo A ",null,"Sujeito Passivo B",null,"Dependente  1",null,"Dependente  2",null,null,null,null,null,null,null,null,null,{"$f":"'Modelo 3'!F43","v":0}]
[null,"SOMA TOTAL →",null,{"$f":"D206","v":0},null,{"$f":"F206","v":0},null,{"$f":"H206","v":0},null,{"$f":"J206","v":0}]
[null,"Continente (PC)",null,"SOMA",{"$f":"SUM(D208:K208)","v":0},{"$f":"IF(T204=1,E209,)","v":0},null,null,"T. Separado",null,null,"Não residentes",null,{"$f":"SUM(T29+V29)/2","v":0}]
[null,"Açores ",null,"SOMA",{"$f":"IF(E209<0,0,E209)","v":0},{"$f":"IF(T204=2,E210,)","v":0},null,"SP A→",{"$f":"IF(T204>=4,0,IF(S204=1,D205+H205+J205,))","v":0},null,"SP A→",{"$f":"IF(T204>=4,N210,)","v":0},null,{"$f":"SUM(P29+P50)+N209","v":0}]
[null,"Madeira",null,"SOMA",{"$f":"IF(E209<0,0,E209)","v":0},{"$f":"IF(T204=3,E211,)","v":0},null,"SP B→",{"$f":"IF(T204>=4,0,IF(S204=1,F205+H205+J205,))","v":0},null,"SP B→",{"$f":"IF(T204>=4,N211,)","v":0},null,{"$f":"SUM(R29+R50)+N209","v":0}]
[null,{"$f":"IF(E209<0,0,SUM(F209+F210+F211))","v":0},null,"← Pagamento por Conta"]
[null,","]
[null,"Art.º 74.º do CIRS - Rendimentos produzidos em anos anteriores Cat. B",null,null,null,null,null,null,null,null,null,null,{"$f":"Artigos!F51","v":0},null,null,null,null,null,{"$f":"'Anexo A'!X253","v":1},{"$f":"IF(Z219=TRUE,4,IF(Z220=TRUE,4,IF(Z221=TRUE,1,'Anexo A'!S46)))","v":1}]
[null,"T.  Separada →",null,{"$f":"IF(S214=1,D217,0)","v":0},null,{"$f":"IF(S214=1,J217+L217,0)","v":0},null,{"$f":"IF(S214=1,D218,0)","v":0},null,{"$f":"IF(S214=1,J218+L218,0)","v":0},null,null,{"$f":"Artigos!F69","v":0}]
[null,"Nº de Anos →",null,null,{"$f":"P31+1","v":1},null,{"$f":"R31+1","v":1},null,null,null,null,null,null,"Rendimento Bruto",null,"Dedução Específica",null,"Rendimento Coletável",null,"Rendi. Anos Anteriores",null,"TAXA","Parcela a Abater",null,{"$f":"D217*H217","v":0}]
[null,"Sujeito Passivo A  →",null,{"$f":"IF(N217<1,0,(T217*R217)/N217*(E216-1)/E216)","v":0},null,{"$f":"(R217-D217+0)","v":0},null,{"$f":"(F217*V217)-W217","v":0},null,{"$f":"IF(S214=1,0,IF(N217<1,0,IF(R217<1,0,(H217*D217)/F217)))","v":0},null,{"$f":"IF(Y216<=0,0,IF(S214=0,0,Y216/M214))","v":0},null,{"$f":"IF('Modelo 3'!F52=4,0,SUM(G101:G117,F135,E171:E177))","v":0},null,{"$f":"D158","v":0},null,{"$f":"IF('Modelo 3'!F7=4,0,IF(N217>P217,N217-P217,0))","v":0},null,{"$f":"P30","v":0},null,{"$f":"IF(S214=0,Artigos!B32,IF(S214=1,Artigos!B50,0))","v":0},{"$f":"IF(S214=0,Artigos!B33,IF(S214=1,Artigos!B51,0))","v":0},null,{"$f":"D218*H218","v":0}]
[null,"Sujeito Passivo B  →",null,{"$f":"IF(N218<1,0,(T218*R218)/N218*(G216-1)/G216)","v":0},null,{"$f":"(R218-D218+0)","v":0},null,{"$f":"(F218*V218)-W218","v":0},null,{"$f":"IF(S214=1,0,IF(N218<1,0,IF(R218<1,0,(H218*D218)/F218)))","v":0},null,{"$f":"IF(Y217<=0,0,IF(S214=0,0,Y217/M215))","v":0},null,{"$f":"IF('Modelo 3'!F52=4,0,SUM(N101:N117,H135,L171:L177))","v":0},null,{"$f":"F158","v":0},null,{"$f":"IF('Modelo 3'!F7=4,0,IF(N218>P218,N218-P218,0))","v":0},null,{"$f":"R30","v":0},null,{"$f":"IF(S214=0,Artigos!B32,IF(S214=1,Artigos!B68,0))","v":0},{"$f":"IF(S214=0,Artigos!B33,IF(S214=1,Artigos!B69,0))","v":0}]
[null,"SOMA TOTAL →",null,{"$f":"SUM(D217:E218)","v":0},null,null,null,null,null,null,null,{"$f":"SUM(J217:M218)","v":0},null,null,null,null,null,null,null,null,null,null,null,null,null,{"$f":"'Modelo 3'!D43","v":0}]
[null,"Continente ",null,"SOMA",{"$f":"SUM(D219)","v":0},null,{"$f":"IF(T214=1,E220,)","v":0},null,{"$f":"SUM(L219)","v":0},null,{"$f":"IF(T214=1,I220,)","v":0},null,null,"T. Separado",null,null,"T. Separado",null,null,null,null,null,null,null,null,{"$f":"'Modelo 3'!E43","v":0}]
[null,"Açores ",null,"SOMA",{"$f":"IF(E220<0,0,E220)","v":0},null,{"$f":"IF(T214=2,E221,)","v":0},null,{"$f":"IF(I220<0,0,I220)","v":0},null,{"$f":"IF(T214=2,I221,)","v":0},null,"SP A→",{"$f":"SUM(D215)","v":0},null,"SP B→",{"$f":"SUM(H215)","v":0},null,"← Quociente dos rendimentos de anos anteriores",null,null,null,null,null,null,{"$f":"'Modelo 3'!F43","v":0}]
[null,"Madeira",null,"SOMA",{"$f":"IF(E220<0,0,E220)","v":0},null,{"$f":"IF(T214=3,E222,)","v":0},null,{"$f":"IF(I220<0,0,I220)","v":0},null,{"$f":"IF(T214=3,I222,)","v":0},null,"SP A→",{"$f":"SUM(F215)","v":0},null,"SP B→",{"$f":"SUM(J215)","v":0},null,"← Imposto correspondente a rendimentos de anos anteriores"]
[null,{"$f":"IF(E220<0,0,SUM(G220:H222))","v":0},null,"← Quociente dos rendimentos de anos anteriores"]
[null,{"$f":"IF(I220<0,0,SUM(K220:L222))","v":0},null,"← Imposto correspondente a rendimentos de anos anteriores"]
[]
[]
[]
[]
[]
[]
[null,"FIM"]

{"sheet":"Anexo E","index":4,"n_rows":101,"n_cols":26,"rows_kept":101,"cut":false,"hidden":false,"merged":[[89,16,89,17],[90,1,90,2],[90,4,90,5],[90,6,90,7],[90,8,90,9],[90,10,90,11],[90,13,90,14],[90,16,90,17],[89,1,89,2],[89,4,89,5],[89,6,89,7],[89,8,89,9],[89,10,89,11],[20,4,20,13],[21,4,21,13],[34,4,34,5],[33,4,33,5],[33,6,33,7],[34,6,34,7],[91,1,91,2],[92,1,92,2],[89,13,89,14],[83,1,83,2],[83,3,83,4],[83,5,83,6],[83,7,83,8],[83,9,83,10],[77,8,77,9],[78,8,78,9],[79,8,79,9],[77,11,77,12],[78,11,78,12],[79,11,79,12],[80,1,80,2],[75,3,75,4],[75,5,75,6],[77,5,77,6],[86,22,86,23],[87,1,87,2],[87,3,87,4],[87,11,87,12],[88,1,88,2],[88,4,88,5],[88,6,88,7],[88,8,88,9],[88,10,88,11],[88,13,88,14],[88,16,88,17],[86,11,86,12],[86,13,86,14],[86,15,86,16],[86,17,86,18],[86,19,86,20],[86,1,86,2],[86,3,86,4],[86,5,86,6],[86,7,86,8],[86,9,86,10],[84,22,84,23],[84,24,84,25],[85,1,85,2],[85,3,85,4],[85,5,85,6],[85,7,85,8],[85,9,85,10],[85,11,85,12],[85,13,85,14],[85,15,85,16],[85,17,85,18],[85,19,85,20],[85,22,85,23],[85,24,85,25],[84,1,84,2],[84,13,84,14],[84,15,84,16],[84,17,84,18],[84,19,84,20],[78,5,78,6],[79,5,79,6],[75,1,75,2],[76,1,76,2],[77,1,77,2],[78,1,78,2],[79,1,79,2],[67,8,67,9],[68,8,68,9],[69,8,69,9],[73,1,73,2],[74,1,74,2],[70,1,70,2],[65,3,65,4],[65,5,65,6],[67,5,67,6],[68,5,68,6],[69,5,69,6],[65,1,65,2],[66,1,66,2],[67,1,67,2],[68,1,68,2],[69,1,69,2],[63,1,63,2],[64,1,64,2],[55,5,55,6],[57,1,57,2],[58,1,58,2],[59,1,59,2],[60,1,60,2],[57,5,57,6],[58,5,58,6],[59,5,59,6],[9,4,9,13],[58,11,58,12],[59,11,59,12],[57,11,57,12],[45,5,45,6],[47,5,47,6],[48,5,48,6],[47,1,47,2],[48,1,48,2],[49,1,49,2],[50,1,50,2],[45,3,45,4],[53,1,53,2],[54,1,54,2],[55,1,55,2],[56,1,56,2],[55,3,55,4],[49,5,49,6],[47,8,47,9],[48,8,48,9],[49,8,49,9],[58,8,58,9],[59,8,59,9],[57,8,57,9],[19,4,19,13],[43,1,43,2],[44,1,44,2],[45,1,45,2],[46,1,46,2],[7,4,7,13],[16,17,16,18],[24,14,25,14],[17,15,17,16],[23,15,23,16],[24,15,24,16],[25,15,25,16],[16,15,16,16],[8,15,8,16],[8,17,8,18],[9,15,9,16],[9,17,9,18],[10,15,10,16],[10,17,10,18],[11,15,11,16],[11,17,11,18],[12,15,12,16],[12,17,12,18],[8,4,8,13],[37,3,37,4],[5,17,5,18],[5,15,5,16],[0,21,1,26],[33,1,33,2],[26,15,26,16],[6,17,6,18],[7,17,7,18],[17,17,17,18],[23,17,23,18],[24,17,24,18],[25,17,25,18],[26,17,26,18],[14,1,14,6],[17,4,17,13],[6,12,6,13],[6,15,6,16],[7,15,7,16],[3,1,3,6],[10,4,10,13],[11,4,11,13],[12,4,12,13],[22,4,22,13],[18,4,18,13]]}
[]
[]
[]
[null,"QUADRO 4A"]
[null,"RENDIMENTOS SUJEITOS A TAXAS ESPECIAIS (art.º 72.º do CIRS)"]
[null,"RENDIMENTOS DE CAPITAIS - [Artigo 5.º do Código do IRS] ",null,null,null,null,null,null,null,null,null,null,null,null,"Campo","Sujeito Passivo A",null,"Sujeito Passivo B"]
[null,"Os sujeitos passivos optam  pelo englobamento dos rendimentos da categoria E,   DO QUADRO 4A ? ",null,null,null,null,null,null,null,null,null,null,"Indique ali a",null,"☞","Opção",null,{"$f":"P7","v":"Opção"}]
[null,"Código dos rendimentos  ➤",null,null,"Clique aqui para indicar o código dos rendimentos",null,null,null,null,null,null,null,null,null,401]
[null,"Código dos rendimentos  ➤",null,null,"Clique aqui para indicar o código dos rendimentos",null,null,null,null,null,null,null,null,null,402]
[null,"Código dos rendimentos  ➤",null,null,"Clique aqui para indicar o código dos rendimentos",null,null,null,null,null,null,null,null,null,403]
[null,"Código dos rendimentos  ➤",null,null,"Clique aqui para indicar o código dos rendimentos",null,null,null,null,null,null,null,null,null,404]
[null,"Código dos rendimentos  ➤",null,null,"Clique aqui para indicar o código dos rendimentos",null,null,null,null,null,null,null,null,null,405]
[null,"Código dos rendimentos  ➤",null,null,"Clique aqui para indicar o código dos rendimentos",null,null,null,null,null,null,null,null,null,406]
[]
[null,"QUADRO 4B"]
[null,"RENDIMENTOS SUJEITOS A TAXAS LIBERATÓRIAS (art.º 71.º do CIRS)"]
[null,"RENDIMENTOS DE CAPITAIS - [Artigo 5.º do Código do IRS] ",null,null,null,null,null,null,null,null,null,null,null,null,"Campo","Sujeito Passivo A",null,"Sujeito Passivo B"]
[null,"Código dos rendimentos  ➤",null,null,"Clique aqui par indicar o código dos rendimentos",null,null,null,null,null,null,null,null,null,451]
[null,"Código dos rendimentos  ➤",null,null,"Clique aqui par indicar o código dos rendimentos",null,null,null,null,null,null,null,null,null,452]
[null,"Código dos rendimentos  ➤",null,null,"Clique aqui par indicar o código dos rendimentos",null,null,null,null,null,null,null,null,null,453]
[null,"Código dos rendimentos  ➤",null,null,"Clique aqui par indicar o código dos rendimentos",null,null,null,null,null,null,null,null,null,454]
[null,"Código dos rendimentos  ➤",null,null,"Clique aqui par indicar o código dos rendimentos",null,null,null,null,null,null,null,null,null,455]
[null,"Código dos rendimentos  ➤",null,null,"Clique aqui par indicar o código dos rendimentos",null,null,null,null,null,null,null,null,null,456]
[null,"Retenções  na fonte de IRS"]
[null,"Rendimentos de anos anteriores  [Incluídos no Quadro 4A e 4B do Anexo E]",null,null,null,null,null,null,null,null,null,null,null,null,"Quadro \n4A e 4B"]
[null,"Indique o N.º de anos"]
[null,"Perdas a reportar do exercício de 2017 a deduzir ao rendimento de 2018  [Veja a Demonstração de Liquidação de IRS do exercício de 2017, enviada pela AT]"]
[]
[]
[]
[]
[null,"INICIO"]
[]
[null,"Opção pelo englobamento da cat. E  ",null,null,"SP A",null,"SP B"]
[null,"Opção",1,null,{"$f":"SUM(P8:Q13,P18:Q23)","v":0},null,{"$f":"SUM(R8:S13,R18:S23)","v":0}]
[null,"Sim",2]
[null,"Não",{"$f":"IF(D38=0,2,IF(D38>=1,3,))","v":2}]
[null,null,{"$f":"VLOOKUP(P7,B35:C37,2,FALSE)","v":1},{"$f":"SUM(P8:Q13,R8:S13)","v":0}]
[]
[null,{"$f":"IF(B51+B61+L59+L60=0,\"➤\",IF(B51+B61+L59+L60>=1,\"Tem\",))","v":"➤"}]
[]
[null,"CATEGORIA E"]
[null,"Art.º 5.º do CIRS - Rendimentos da categoria E",null,null,null,null,null,null,null,null,null,null,null,null,null,null,null,{"$f":"'Anexo A'!R46","v":1},{"$f":"IF(S44=TRUE,4,IF(S45=TRUE,4,IF(S46=TRUE,4,'Anexo A'!S46)))","v":1}]
[null,"T.  Separada →",null,{"$f":"IF(R43=1,D47,0)","v":0},null,{"$f":"IF(R43=1,F47,0)","v":0},null,null,null,null,null,null,null,null,null,null,null,null,{"$f":"'Modelo 3'!D43","v":0}]
[null,"Rendimento Bruto →",null,{"$f":"SUM(P8:Q13,P18:Q23)","v":0},null,{"$f":"SUM(R8:S13,R18:S23)","v":0},null,null,null,null,null,null,null,null,null,null,null,null,{"$f":"'Modelo 3'!E43","v":0}]
[null,null,null,"Sujeito Passivo A ",null,"Sujeito Passivo B",null,null,null,null,null,null,null,null,null,null,null,null,{"$f":"'Modelo 3'!F43","v":0}]
[null,"SOMA TOTAL →",null,{"$f":"IF(C38<=2,D45,)","v":0},null,{"$f":"IF(C38<=2,F45,)","v":0}]
[null,"Continente (RB)",null,"SOMA",{"$f":"SUM(D47:F47)","v":0},{"$f":"IF(S43=1,E48,)","v":0},null,null,"T. Separado"]
[null,"Açores ",null,"SOMA",{"$f":"IF(E48<0,0,E48)","v":0},{"$f":"IF(S43=2,E49,)","v":0},null,"SP A→",{"$f":"IF(S43>=4,0,IF(R43=1,D44,))","v":0}]
[null,"Madeira",null,"SOMA",{"$f":"IF(E48<0,0,E48)","v":0},{"$f":"IF(S43=3,E50,)","v":0},null,"SP B→",{"$f":"IF(S43>=4,0,IF(R43=1,F44,))","v":0}]
[null,{"$f":"IF(E48<0,0,SUM(F48+F49+F50))","v":0},null,"← Rendimento bruto"]
[]
[null,"Art.º 5.º do CIRS - Rendimentos da categoria E Opção pela tributação autónoma ",null,null,null,null,null,null,null,null,null,null,null,null,null,{"$f":"'Modelo 3'!P36","v":0.28000000000000003},{"$f":"'Modelo 3'!T36","v":0.28000000000000003},{"$f":"'Anexo A'!R46","v":1},{"$f":"IF(S54=TRUE,4,IF(S55=TRUE,4,IF(S56=TRUE,4,'Anexo A'!S46)))","v":1}]
[null,"T.  Separada →",null,{"$f":"IF(R53=1,D57,0)","v":0},null,{"$f":"IF(R53=1,F57,0)","v":0},null,null,null,null,null,null,null,null,null,null,null,null,{"$f":"'Modelo 3'!D43","v":0}]
[null,"Rendimento Bruto →",null,{"$f":"SUM(P8:Q13)","v":0},null,{"$f":"SUM(R8:S13)","v":0},null,null,null,null,null,null,null,null,null,null,null,null,{"$f":"'Modelo 3'!E43","v":0}]
[null,null,null,"Sujeito Passivo A ",null,"Sujeito Passivo B",null,null,null,null,null,null,null,null,null,null,null,null,{"$f":"'Modelo 3'!F43","v":0}]
[null,"SOMA TOTAL →",null,{"$f":"IF(C38=3,D55*P53,)","v":0},null,{"$f":"IF(C38=3,F55*P53,)","v":0}]
[null,"Continente (TA)",null,"SOMA",{"$f":"SUM(D57:G57)","v":0},{"$f":"IF(S53=1,E58,)","v":0},null,null,"T. Separado",null,null,"Não residentes"]
[null,"Açores ",null,"SOMA",{"$f":"IF(E58<0,0,E58)","v":0},{"$f":"IF(S53=2,E59,)","v":0},null,"SP A→",{"$f":"IF(S53>=4,0,IF(R53=1,D54,))","v":0},null,"SP A→",{"$f":"IF(S53>=4,O59,)","v":0},null,{"$f":"SUM(D55)","v":0},{"$f":"N59*Q53","v":0}]
[null,"Madeira",null,"SOMA",{"$f":"IF(E58<0,0,E58)","v":0},{"$f":"IF(S53=3,E60,)","v":0},null,"SP B→",{"$f":"IF(S53>=4,0,IF(R53=1,F54,))","v":0},null,"SP B→",{"$f":"IF(S53>=4,O60,)","v":0},null,{"$f":"SUM(F55)","v":0},{"$f":"N60*Q53","v":0}]
[null,{"$f":"IF(E58<0,0,SUM(F58+F59+F60))","v":0},null,"← Tributação autónoma"]
[]
[null," Reporte de prejuízos da categoria E",null,null,null,null,null,null,null,null,null,null,null,null,null,null,null,{"$f":"'Anexo A'!R46","v":1},{"$f":"IF(S64=TRUE,4,IF(S65=TRUE,4,IF(S66=TRUE,4,'Anexo A'!S46)))","v":1}]
[null,"T.  Separada →",null,{"$f":"IF(R63=1,D67,0)","v":0},null,{"$f":"IF(R63=1,F67,0)","v":0},null,null,null,null,null,null,null,null,null,null,null,null,{"$f":"'Modelo 3'!D43","v":0}]
[null,"Rendimento Bruto →",null,{"$f":"SUM(P8+P18,0)","v":0},null,{"$f":"SUM(R8+R18)","v":0},null,null,null,null,null,null,null,null,null,null,null,null,{"$f":"'Modelo 3'!E43","v":0}]
[null,null,null,"Sujeito Passivo A ",null,"Sujeito Passivo B",null,null,null,null,null,null,null,null,null,null,null,null,{"$f":"'Modelo 3'!F43","v":0}]
[null,"SOMA TOTAL →",null,{"$f":"IF(D65>E67,E67,D65)","v":0},{"$f":"P27","v":0},{"$f":"IF(F65>G67,G67,F65)","v":0},{"$f":"R27","v":0}]
[null,"Continente (RP)",null,"SOMA",{"$f":"SUM(D67+F67)","v":0},{"$f":"IF(S63=1,E68,)","v":0},null,null,"T. Separado"]
[null,"Açores ",null,"SOMA",{"$f":"IF(E68<0,0,E68)","v":0},{"$f":"IF(S63=2,E69,)","v":0},null,"SP A→",{"$f":"IF(S63>=4,0,IF(R63=1,D64,))","v":0}]
[null,"Madeira",null,"SOMA",{"$f":"IF(E68<0,0,E68)","v":0},{"$f":"IF(S63=3,E70,)","v":0},null,"SP B→",{"$f":"IF(S63>=4,0,IF(R63=1,F64,))","v":0}]
[null,{"$f":"IF(E68<0,0,SUM(F68+F69+F70))","v":0},null,"← Reporte de Prejuízos Fiscais"]
[]
[null," Retenção na fonte da Categoria E",null,null,null,null,null,null,null,null,null,null,null,null,null,null,null,{"$f":"'Anexo A'!R46","v":1},{"$f":"IF(S74=TRUE,4,IF(S75=TRUE,4,IF(S76=TRUE,4,'Anexo A'!S46)))","v":1}]
[null,"T.  Separada →",null,{"$f":"IF(R73=1,D77,0)","v":0},null,{"$f":"IF(R73=1,F77,0)","v":0},null,null,null,null,null,null,null,null,null,null,null,null,{"$f":"'Modelo 3'!D43","v":0}]
[null,"Rendimento Bruto →",null,{"$f":"SUM(P24)","v":0},null,{"$f":"SUM(R24)","v":0},null,null,null,null,null,null,null,null,null,null,null,null,{"$f":"'Modelo 3'!E43","v":0}]
[null,null,null,"Sujeito Passivo A ",null,"Sujeito Passivo B",null,null,null,null,null,null,null,null,null,null,null,null,{"$f":"'Modelo 3'!F43","v":0}]
[null,"SOMA TOTAL →",null,{"$f":"D75","v":0},null,{"$f":"F75","v":0}]
[null,"Continente (RF)",null,"SOMA",{"$f":"SUM(D77:G77)","v":0},{"$f":"IF(S73=1,E78,)","v":0},null,null,"T. Separado",null,null,"Não residentes"]
[null,"Açores ",null,"SOMA",{"$f":"IF(E78<0,0,E78)","v":0},{"$f":"IF(S73=2,E79,)","v":0},null,"SP A→",{"$f":"IF(S73>=4,0,IF(R73=1,D74,))","v":0},null,"SP A→",{"$f":"IF(S73>=4,N79,)","v":0},null,{"$f":"SUM(D75)","v":0}]
[null,"Madeira",null,"SOMA",{"$f":"IF(E78<0,0,E78)","v":0},{"$f":"IF(S73=3,E80,)","v":0},null,"SP B→",{"$f":"IF(S73>=4,0,IF(R73=1,F74,))","v":0},null,"SP B→",{"$f":"IF(S73>=4,N80,)","v":0},null,{"$f":"SUM(F75)","v":0}]
[null,{"$f":"IF(E78<0,0,SUM(F78+F79+F80))","v":0},null,"← Retenção na Fonte"]
[]
[null,"Art.º 74.º do CIRS - Rendimentos produzidos em anos anteriores Cat. B",null,null,null,null,null,null,null,null,null,null,{"$f":"Artigos!F51","v":0},null,null,null,null,null,{"$f":"'Anexo A'!R46","v":1},{"$f":"IF(Z88=TRUE,4,IF(Z89=TRUE,4,IF(Z90=TRUE,4,'Anexo A'!S46)))","v":1}]
[null,"T.  Separada →",null,{"$f":"IF(S83=1,D86,0)","v":0},null,{"$f":"IF(S83=1,J86+L86,0)","v":0},null,{"$f":"IF(S83=1,D87,0)","v":0},null,{"$f":"IF(S83=1,J87+L87,0)","v":0},null,null,{"$f":"Artigos!F69","v":0}]
[null,"Nº de Anos →",null,null,{"$f":"P26+1","v":1},null,{"$f":"R26+1","v":1},null,null,null,null,null,null,"Rendimento Bruto",null,"Dedução Específica",null,"Rendimento Coletável",null,"Rendi. Anos Anteriores",null,"TAXA","Parcela a Abater",null,{"$f":"D86*H86","v":0}]
[null,"Sujeito Passivo A  →",null,{"$f":"IF(N86<1,0,(T86*R86)/N86*(E85-1)/E85)","v":0},null,{"$f":"(R86-D86+0)","v":0},null,{"$f":"(F86*V86)-W86","v":0},null,{"$f":"IF(S83=1,0,IF(N86<1,0,IF(R86<1,0,(H86*D86)/F86)))","v":0},null,{"$f":"IF(Y85<=0,0,IF(S83=0,0,Y85/M83))","v":0},null,{"$f":"IF('Modelo 3'!F52=4,0,E35)","v":0},null,0,null,{"$f":"IF('Modelo 3'!F52=4,0,IF(N86>P86,N86-P86,0))","v":0},null,{"$f":"SUM(P25)","v":0},null,{"$f":"IF(S83=0,Artigos!B32,IF(S83=1,Artigos!B50,0))","v":0},{"$f":"IF(S83=0,Artigos!B33,IF(S83=1,Artigos!B51,0))","v":0},null,{"$f":"D87*H87","v":0}]
[null,"Sujeito Passivo B  →",null,{"$f":"IF(N87<1,0,(T87*R87)/N87*(G85-1)/G85)","v":0},null,{"$f":"(R87-D87+0)","v":0},null,{"$f":"(F87*V87)-W87","v":0},null,{"$f":"IF(S83=1,0,IF(N87<1,0,IF(R87<1,0,(H87*D87)/F87)))","v":0},null,{"$f":"IF(Y86<=0,0,IF(S83=0,0,Y86/M84))","v":0},null,{"$f":"IF('Modelo 3'!F52=4,0,G35)","v":0},null,0,null,{"$f":"IF('Modelo 3'!F52=4,0,IF(N87>P87,N87-P87,0))","v":0},null,{"$f":"R25","v":0},null,{"$f":"IF(S83=0,Artigos!B32,IF(S83=1,Artigos!B68,0))","v":0},{"$f":"IF(S83=0,Artigos!B33,IF(S83=1,Artigos!B69,0))","v":0}]
[null,"SOMA TOTAL →",null,{"$f":"SUM(D86:E87)","v":0},null,null,null,null,null,null,null,{"$f":"SUM(J86:M87)","v":0},null,null,null,null,null,null,null,null,null,null,null,null,null,{"$f":"'Modelo 3'!D43","v":0}]
[null,"Continente ",null,"SOMA",{"$f":"SUM(D88)","v":0},null,{"$f":"IF(T83=1,E89,)","v":0},null,{"$f":"SUM(L88)","v":0},null,{"$f":"IF(T83=1,I89,)","v":0},null,null,"T. Separado",null,null,"T. Separado",null,null,null,null,null,null,null,null,{"$f":"'Modelo 3'!E43","v":0}]
[null,"Açores ",null,"SOMA",{"$f":"IF(E89<0,0,E89)","v":0},null,{"$f":"IF(T83=2,E90,)","v":0},null,{"$f":"IF(I89<0,0,I89)","v":0},null,{"$f":"IF(T83=2,I90,)","v":0},null,"SP A→",{"$f":"SUM(D84)","v":0},null,"SP B→",{"$f":"SUM(H84)","v":0},null,"← Quociente dos rendimentos de anos anteriores",null,null,null,null,null,null,{"$f":"'Modelo 3'!F43","v":0}]
[null,"Madeira",null,"SOMA",{"$f":"IF(E89<0,0,E89)","v":0},null,{"$f":"IF(T83=3,E91,)","v":0},null,{"$f":"IF(I89<0,0,I89)","v":0},null,{"$f":"IF(T83=3,I91,)","v":0},null,"SP A→",{"$f":"SUM(F84)","v":0},null,"SP B→",{"$f":"SUM(J84)","v":0},null,"← Imposto correspondente a rendimentos de anos anteriores"]
[null,{"$f":"IF(E89<0,0,SUM(G89:H91))","v":0},null,"← Quociente dos rendimentos de anos anteriores"]
[null,{"$f":"IF(I89<0,0,SUM(K89:L91))","v":0},null,"← Imposto correspondente a rendimentos de anos anteriores"]
[]
[]
[]
[]
[]
[]
[]
[null,"FIM"]

{"sheet":"Anexo F","index":5,"n_rows":109,"n_cols":26,"rows_kept":109,"cut":false,"hidden":false,"merged":[[100,1,100,2],[101,1,101,2],[98,1,98,2],[98,4,98,5],[98,6,98,7],[98,8,98,9],[98,10,98,11],[98,13,98,14],[98,16,98,17],[99,1,99,2],[99,4,99,5],[99,6,99,7],[99,8,99,9],[99,10,99,11],[99,13,99,14],[99,16,99,17],[95,19,95,20],[95,22,95,23],[96,1,96,2],[96,3,96,4],[96,11,96,12],[97,1,97,2],[97,4,97,5],[97,6,97,7],[97,8,97,9],[97,10,97,11],[97,13,97,14],[97,16,97,17],[95,1,95,2],[95,3,95,4],[95,5,95,6],[95,7,95,8],[95,9,95,10],[95,11,95,12],[95,13,95,14],[95,15,95,16],[95,17,95,18],[93,19,93,20],[93,22,93,23],[93,24,93,25],[94,1,94,2],[94,3,94,4],[94,5,94,6],[94,7,94,8],[94,9,94,10],[94,11,94,12],[94,13,94,14],[94,15,94,16],[94,17,94,18],[94,19,94,20],[94,22,94,23],[94,24,94,25],[92,1,92,2],[92,3,92,4],[92,5,92,6],[92,7,92,8],[92,9,92,10],[93,1,93,2],[93,13,93,14],[93,15,93,16],[93,17,93,18],[89,1,89,2],[86,5,86,6],[87,5,87,6],[88,5,88,6],[86,8,86,9],[87,8,87,9],[88,8,88,9],[86,11,86,12],[87,11,87,12],[88,11,88,12],[29,1,29,2],[29,4,29,5],[29,7,29,8],[20,16,20,17],[21,16,21,17],[22,16,22,17],[86,1,86,2],[87,1,87,2],[88,1,88,2],[41,5,41,6],[43,1,43,2],[44,1,44,2],[45,1,45,2],[46,1,46,2],[43,5,43,6],[44,5,44,6],[45,5,45,6],[39,1,39,2],[40,1,40,2],[41,1,41,2],[42,1,42,2],[41,3,41,4],[51,1,51,2],[52,1,52,2],[22,18,22,19],[15,1,15,6],[16,16,16,17],[16,18,16,19],[17,16,17,17],[18,16,18,17],[19,16,19,17],[17,18,17,19],[18,18,18,19],[19,18,19,19],[20,18,20,19],[21,18,21,19],[13,16,13,17],[6,18,6,19],[7,18,7,19],[8,18,8,19],[9,18,9,19],[10,18,10,19],[11,18,11,19],[12,18,12,19],[13,18,13,19],[10,16,10,17],[0,20,1,21],[3,1,3,6],[7,13,7,14],[11,15,12,15],[5,16,5,17],[11,16,11,17],[12,16,12,17],[5,18,5,19],[6,16,6,17],[7,16,7,17],[8,16,8,17],[9,16,9,17],[53,1,53,2],[56,1,56,2],[43,8,43,9],[44,8,44,9],[45,8,45,9],[49,1,49,2],[50,1,50,2],[53,3,53,4],[53,5,53,6],[54,1,55,2],[56,8,56,9],[57,8,57,9],[58,8,58,9],[56,11,56,12],[57,11,57,12],[58,11,58,12],[69,1,69,2],[64,3,64,4],[64,5,64,6],[56,5,56,6],[57,5,57,6],[58,5,58,6],[66,5,66,6],[67,5,67,6],[68,5,68,6],[68,1,68,2],[59,1,59,2],[63,1,63,2],[64,1,64,2],[65,1,65,2],[66,1,66,2],[67,1,67,2],[57,1,57,2],[58,1,58,2],[62,1,62,2],[74,1,74,2],[75,1,75,2],[74,3,74,4],[74,5,74,6],[76,1,76,2],[66,8,66,9],[67,8,67,9],[68,8,68,9],[72,1,72,2],[73,1,73,2],[84,1,84,2],[85,1,85,2],[84,3,84,4],[84,5,84,6],[76,8,76,9],[77,8,77,9],[78,8,78,9],[82,1,82,2],[83,1,83,2],[77,1,77,2],[78,1,78,2],[79,1,79,2],[76,5,76,6],[77,5,77,6],[78,5,78,6]]}
[]
[]
[]
[null,"QUADRO 4"]
[null,"RENDIMENTOS, RENDAS ✚ ALOJAMENTO LOCAL OPÇÃO PELA CATEGORIA F"]
[null,"RENDIMENTOS PREDIAIS - [Artigo 8.º do Código do IRS] ",null,null,null,null,null,null,null,null,null,null,null,null,null,"Campo","Sujeito Passivo A",null,"Sujeito Passivo B"]
[null,"Este imóvel está abrangido pelo previsto nos  n.ºs 6 e 23 do art.º 71.º do EBF ? ",null,null,null,null,null,null,null,null,null,null,null,null,null,"☞","Indique aqui",null,"Indique aqui"]
[null,"Os sujeitos passivos optam pelo englobamento dos rendimentos  da Categoria F ? ",null,null,null,null,null,null,null,null,null,null,null,"Indique ali a",null,"☞","Opção",null,{"$f":"Q8","v":"Opção"}]
[null,"Rendimentos prediais  [Rendas] ",null,null,null,null,null,null,null,null,null,null,null,null,null,4001]
[null,"Atividade de Alojamento local, na modalidade de moradia ou apartamento  [Opção pelas regras da categoria F]"]
[null,"Retenções  na fonte de IRS"]
[null,"Rendimentos de anos anteriores  [Incluídos no Quadro 4 do Anexo F]",null,null,null,null,null,null,null,null,null,null,null,null,null,"Quadro 4"]
[null,"Indique o N.º de anos"]
[null,"Perdas a reportar do exercício de 2017 a deduzir ao rendimento de 2018  [Veja a Demonstração de Liquidação de IRS do exercício de 2017, enviada pela AT]"]
[]
[null,"QUADRO 5A"]
[null,"GASTOS SUPORTADOS E PAGOS  APÓS O INÍCIO DO ARRENDAMENTO ✚ ALOJAMENTO LOCAL OPÇÃO PELA CATEGORIA F",null,null,null,null,null,null,null,null,null,null,null,null,null,"Campo","Sujeito Passivo A",null,"Sujeito Passivo B"]
[null,"Conservação e manutenção"]
[null,"Condomínio"]
[null,"Imposto municipal sobre imóveis  IMI  [Não insira nesta linha o Adicional ao IMI previsto no Art.º 135.º-I do CIMI]"]
[null,"Imposto do selo"]
[null,"Taxas autárquicas"]
[null,"Outros"]
[]
[]
[]
[]
[null,"INICIO"]
[]
[null,"Imóvel foi objeto de ações de reabilitação SP A\n",null,null,"Imóvel foi objeto de ações de reabilitação SP B\n",null,null,"Opção pelo englobamento da cat. F"]
[null,"Indique aqui",1,null,"Indique aqui",1,null,"Opção",1]
[null,"Sim",2,null,"Sim",2,null,"Sim",2]
[null,"Não",3,null,"Não",3,null,"Não",3]
[null,null,{"$f":"VLOOKUP(Q7,B31:C33,2,FALSE)","v":1},null,null,{"$f":"VLOOKUP(S7,E31:F33,2,FALSE)","v":1},null,null,{"$f":"VLOOKUP(Q8,H31:I33,2,FALSE)","v":1}]
[]
[null,{"$f":"IF(B47+B60+L58+L59=0,\"➤\",IF(B47+B60+L58+L59>=1,\"Tem\",))","v":"➤"}]
[]
[null,"CATEGORIA F"]
[null,"Art.º 8.º do CIRS - Rendimentos da categoria F",null,null,null,null,null,null,null,null,null,null,{"$f":"IF(D43+F43>=1,IF('Modelo 3'!E40=TRUE,3,0))","v":false},null,null,null,null,{"$f":"'Anexo A'!R46","v":1},{"$f":"IF(S40=TRUE,4,IF(S41=TRUE,4,IF(S42=TRUE,4,'Anexo A'!S46)))","v":1}]
[null,"T.  Separada →",null,{"$f":"IF(R39=1,D43,0)","v":0},null,{"$f":"IF(R39=1,F43,0)","v":0},null,null,null,null,null,null,null,null,null,null,null,null,{"$f":"'Modelo 3'!D43","v":0}]
[null,"Rendimento Bruto →",null,{"$f":"IF(C34=2,0,IF(I34=3,0,Q9+Q10))","v":0},null,{"$f":"IF(F34=2,0,IF(I34=3,0,S9+S10))","v":0},null,null,null,null,null,null,null,null,null,null,null,null,{"$f":"'Modelo 3'!E43","v":0}]
[null,null,null,"Sujeito Passivo A ",null,"Sujeito Passivo B",null,null,null,null,null,null,null,null,null,null,null,null,{"$f":"'Modelo 3'!F43","v":0}]
[null,"SOMA TOTAL →",null,{"$f":"IF(D55+D56>=1,0,D41)","v":0},null,{"$f":"IF(F55+F56>=1,0,F41)","v":0}]
[null,"Continente (RB)",null,"SOMA",{"$f":"SUM(D43:F43)","v":0},{"$f":"IF(S39=1,E44,)","v":0},null,null,"T. Separado"]
[null,"Açores ",null,"SOMA",{"$f":"IF(E44<0,0,E44)","v":0},{"$f":"IF(S39=2,E45,)","v":0},null,"SP A→",{"$f":"IF(S39>=4,0,IF(R39=1,D40,))","v":0}]
[null,"Madeira",null,"SOMA",{"$f":"IF(E44<0,0,E44)","v":0},{"$f":"IF(S39=3,E46,)","v":0},null,"SP B→",{"$f":"IF(S39>=4,0,IF(R39=1,F40,))","v":0}]
[null,{"$f":"IF(E44<0,0,SUM(F44+F45+F46))","v":0},null,"← Rendimento bruto"]
[]
[null,"Art.º 8.º do CIRS - Rendimentos da categoria F (Imóvel recuperado ou objeto de ações de reabilitação + Tributaçã Autónoma )",null,null,null,null,null,null,null,null,null,null,null,null,null,null,null,{"$f":"'Anexo A'!R46","v":1},{"$f":"IF(S50=TRUE,4,IF(S51=TRUE,4,IF(S52=TRUE,4,'Anexo A'!S46)))","v":1}]
[null,"T.  Separada →",null,{"$f":"IF(R49=1,D55+D56,0)","v":0},null,{"$f":"IF(R49=1,F55+F56,0)","v":0},null,null,null,null,null,null,null,null,null,null,null,null,{"$f":"'Modelo 3'!D43","v":0}]
[null,"Rendimento Bruto →",null,{"$f":"Q9+Q10-D64","v":0},null,{"$f":"S9+S10-F64","v":0},null,null,null,null,null,null,null,null,null,null,null,null,{"$f":"'Modelo 3'!E43","v":0}]
[null,null,null,{"$f":"Q9+Q10-D64","v":0},null,{"$f":"S9+S10-F64","v":0},null,null,null,null,null,null,null,null,null,null,null,null,{"$f":"'Modelo 3'!F43","v":0}]
[null,"Taxa →",null,{"$f":"'Modelo 3'!M36","v":0.05},{"$f":"'Modelo 3'!P36","v":0.28000000000000003},null,null,null,null,null,null,null,null,{"$f":"'Modelo 3'!T36","v":0.28000000000000003}]
[null,null,null,"Sujeito Passivo A ",null,"Sujeito Passivo B"]
[null,"SOMA TOTAL →",null,{"$f":"IF(C34=2,D51*D53,0)","v":0},null,{"$f":"IF(F34=2,F51*D53,0)","v":0}]
[null,null,null,{"$f":"IF(D55>=1,0,IF(I34=3,D52*E53,))","v":0},null,{"$f":"IF(F55>=1,0,IF(I34=3,F52*E53,))","v":0}]
[null,"Continente (TA)",null,"SOMA",{"$f":"SUM(D55:F56)","v":0},{"$f":"IF(S49=1,E57,)","v":0},null,null,"T. Separado",null,null,"Não residentes"]
[null,"Açores ",null,"SOMA",{"$f":"IF(E57<0,0,E57)","v":0},{"$f":"IF(S49=2,E58,)","v":0},null,"SP A→",{"$f":"IF(S49>=4,0,IF(R49=1,D50,))","v":0},null,"SP A→",{"$f":"IF(S49>=4,O58,)","v":0},null,{"$f":"SUM(Q9+Q10)-D66","v":0},{"$f":"(N58*N53)","v":0}]
[null,"Madeira",null,"SOMA",{"$f":"IF(E57<0,0,E57)","v":0},{"$f":"IF(S49=3,E59,)","v":0},null,"SP B→",{"$f":"IF(S49>=4,0,IF(R49=1,F50,))","v":0},null,"SP B→",{"$f":"IF(S49>=4,O59,)","v":0},null,{"$f":"SUM(S9+S10)-F66","v":0},{"$f":"(N59*N53)","v":0}]
[null,{"$f":"IF(E57<0,0,SUM(F57+F58+F59))","v":0},null,"← Tributação Autónoma"]
[]
[null,"Dedução específica da categoria F",null,null,null,null,null,null,null,null,null,null,null,null,null,null,null,{"$f":"'Anexo A'!R46","v":1},{"$f":"IF(S63=TRUE,4,IF(S64=TRUE,4,IF(S65=TRUE,4,'Anexo A'!S46)))","v":1}]
[null,"T.  Separada →",null,{"$f":"IF(R62=1,D66,0)","v":0},null,{"$f":"IF(R62=1,F66,0)","v":0},null,null,null,null,null,null,null,null,null,null,null,null,{"$f":"'Modelo 3'!D43","v":0}]
[null,"Rendimento Bruto →",null,{"$f":"SUM(Q18:R23)","v":0},null,{"$f":"SUM(S18:T23)","v":0},null,null,null,null,null,null,null,null,null,null,null,null,{"$f":"'Modelo 3'!E43","v":0}]
[null,null,null,"Sujeito Passivo A ",null,"Sujeito Passivo B",null,null,null,null,null,null,null,null,null,null,null,null,{"$f":"'Modelo 3'!F43","v":0}]
[null,"SOMA TOTAL →",null,{"$f":"IF(D55+D56=0,D64,)","v":0},null,{"$f":"IF(F55+F56=0,F64,)","v":0}]
[null,"Continente (DE)",null,"SOMA",{"$f":"SUM(D66:F66)","v":0},{"$f":"IF(S62=1,E67,)","v":0},null,null,"T. Separado"]
[null,"Açores ",null,"SOMA",{"$f":"IF(E67<0,0,E67)","v":0},{"$f":"IF(S62=2,E68,)","v":0},null,"SP A→",{"$f":"IF(S62>=4,0,IF(R62=1,D63,))","v":0}]
[null,"Madeira",null,"SOMA",{"$f":"IF(E67<0,0,E67)","v":0},{"$f":"IF(S62=3,E69,)","v":0},null,"SP B→",{"$f":"IF(S62>=4,0,IF(R62=1,F63,))","v":0}]
[null,{"$f":"IF(E67<0,0,SUM(F67+F68+F69))","v":0},null,"←  Dedução específica"]
[]
[null,"Reporte de Prejuízos Fiscais",null,null,null,null,null,null,null,null,null,null,null,null,null,null,null,{"$f":"'Anexo A'!R46","v":1},{"$f":"IF(S73=TRUE,4,IF(S74=TRUE,4,IF(S75=TRUE,1,'Anexo A'!S46)))","v":1}]
[null,"T.  Separada →",null,{"$f":"IF(R72=1,D76,0)","v":0},null,{"$f":"IF(R72=1,F76,0)","v":0},null,null,null,null,null,null,null,null,null,null,null,null,{"$f":"'Modelo 3'!D43","v":0}]
[null,"Rendimento Bruto →",null,{"$f":"IF(D43>=1,Q14,)","v":0},null,{"$f":"IF(F43>=1,S14,)","v":0},null,null,null,null,null,null,null,null,null,null,null,null,{"$f":"'Modelo 3'!E43","v":0}]
[null,null,null,"Sujeito Passivo A ",null,"Sujeito Passivo B",null,null,null,null,null,null,null,null,null,null,null,null,{"$f":"'Modelo 3'!F43","v":0}]
[null,"SOMA TOTAL →",null,{"$f":"IF(D74>E76,E76,D74)","v":0},{"$f":"D43","v":0},{"$f":"IF(F74>G76,G76,F74)","v":0},{"$f":"F43","v":0}]
[null,"Continente (RP)",null,"SOMA",{"$f":"SUM(D76+F76)","v":0},{"$f":"IF(S72=1,E77,)","v":0},null,null,"T. Separado"]
[null,"Açores ",null,"SOMA",{"$f":"IF(E77<0,0,E77)","v":0},{"$f":"IF(S72=2,E78,)","v":0},null,"SP A→",{"$f":"IF(S72>=4,0,IF(R72=1,D73,))","v":0}]
[null,"Madeira",null,"SOMA",{"$f":"IF(E77<0,0,E77)","v":0},{"$f":"IF(S72=3,E79,)","v":0},null,"SP B→",{"$f":"IF(S72>=4,0,IF(R72=1,F73,))","v":0}]
[null,{"$f":"IF(E77<0,0,SUM(F77+F78+F79))","v":0},null,"←  Reporte de Prejuízos Fiscais"]
[]
[null,"Retenção na fonte da Categoria F ",null,null,null,null,null,null,null,null,null,null,null,null,null,null,null,{"$f":"'Anexo A'!R46","v":1},{"$f":"IF(S83=TRUE,4,IF(S84=TRUE,4,IF(S85=TRUE,1,'Anexo A'!S46)))","v":1}]
[null,"T.  Separada →",null,{"$f":"IF(R82=1,D86,0)","v":0},null,{"$f":"IF(R82=1,F86,0)","v":0},null,null,null,null,null,null,null,null,null,null,null,null,{"$f":"'Modelo 3'!D43","v":0}]
[null,"Rendimento Bruto →",null,{"$f":"Q11","v":0},null,{"$f":"S11","v":0},null,null,null,null,null,null,null,null,null,null,null,null,{"$f":"'Modelo 3'!E43","v":0}]
[null,null,null,"Sujeito Passivo A ",null,"Sujeito Passivo B",null,null,null,null,null,null,null,null,null,null,null,null,{"$f":"'Modelo 3'!F43","v":0}]
[null,"SOMA TOTAL →",null,{"$f":"D84","v":0},null,{"$f":"F84","v":0}]
[null,"Continente (RF)",null,"SOMA",{"$f":"SUM(D86+F86)","v":0},{"$f":"IF(S82=1,E87,)+L88+L89","v":0},null,null,"T. Separado",null,null,"Não residentes"]
[null,"Açores ",null,"SOMA",{"$f":"IF(E87<0,0,E87)","v":0},{"$f":"IF(S82=2,E88,)","v":0},null,"SP A→",{"$f":"IF(S82>=4,0,IF(R82=1,D83,))+L88","v":0},null,"SP A→",{"$f":"IF(S82>=4,N88,)","v":0},null,{"$f":"Q11","v":0}]
[null,"Madeira",null,"SOMA",{"$f":"IF(E87<0,0,E87)","v":0},{"$f":"IF(S82=3,E89,)","v":0},null,"SP B→",{"$f":"IF(S82>=4,0,IF(R82=1,F83,))+L89","v":0},null,"SP B→",{"$f":"IF(S82>=4,N89,)","v":0},null,{"$f":"S11","v":0}]
[null,{"$f":"IF(E87<0,0,SUM(F87+F88+F89))","v":0},null,"←  Retenção na Fonte"]
[]
[null,"Art.º 74.º do CIRS - Rendimentos produzidos em anos anteriores Cat. F",null,null,null,null,null,null,null,null,null,null,{"$f":"Artigos!F51","v":0},null,null,null,null,null,{"$f":"'Anexo A'!R46","v":1},{"$f":"IF(Z97=TRUE,4,IF(Z98=TRUE,4,IF(Z99=TRUE,1,'Anexo A'!S46)))","v":1}]
[null,"T.  Separada →",null,{"$f":"IF(S92=1,D95,0)","v":0},null,{"$f":"IF(S92=1,J95+L95,0)","v":0},null,{"$f":"IF(S92=1,D96,0)","v":0},null,{"$f":"IF(S92=1,J96+L96,0)","v":0},null,null,{"$f":"Artigos!F69","v":0}]
[null,"Nº de Anos →",null,null,{"$f":"Q13+1","v":1},null,{"$f":"S13+1","v":1},null,null,null,null,null,null,"Rendimento Bruto",null,"Dedução Específica",null,"Rendimento Coletável",null,"Rendi. Anos Anteriores",null,"TAXA","Parcela a Abater",null,{"$f":"D95*H95","v":0}]
[null,"Sujeito Passivo A  →",null,{"$f":"IF(N95<1,0,(T95*R95)/N95*(E94-1)/E94)","v":0},null,{"$f":"(R95-D95+0)","v":0},null,{"$f":"(F95*V95)-W95","v":0},null,{"$f":"IF(S92=1,0,IF(N95<1,0,IF(R95<1,0,(H95*D95)/F95)))","v":0},null,{"$f":"IF(Y94<=0,0,IF(S92=0,0,Y94/M92))","v":0},null,{"$f":"IF('Modelo 3'!F52=4,0,Q9+Q10)","v":0},null,{"$f":"D64","v":0},null,{"$f":"IF('Modelo 3'!F52=4,0,IF(N95>P95,N95-P95,0))","v":0},null,{"$f":"SUM(Q12)","v":0},null,{"$f":"IF(S92=0,Artigos!B32,IF(S92=1,Artigos!B50,0))","v":0},{"$f":"IF(S92=0,Artigos!B33,IF(S92=1,Artigos!B51,0))","v":0},null,{"$f":"D96*H96","v":0}]
[null,"Sujeito Passivo B  →",null,{"$f":"IF(N96<1,0,(T96*R96)/N96*(G94-1)/G94)","v":0},null,{"$f":"(R96-D96+0)","v":0},null,{"$f":"(F96*V96)-W96","v":0},null,{"$f":"IF(S92=1,0,IF(N96<1,0,IF(R96<1,0,(H96*D96)/F96)))","v":0},null,{"$f":"IF(Y95<=0,0,IF(S92=0,0,Y95/M93))","v":0},null,{"$f":"IF('Modelo 3'!F52=4,0,S9+S10)","v":0},null,{"$f":"F64","v":0},null,{"$f":"IF('Modelo 3'!F52=4,0,IF(N96>P96,N96-P96,0))","v":0},null,{"$f":"SUM(S12)","v":0},null,{"$f":"IF(S92=0,Artigos!B32,IF(S92=1,Artigos!B68,0))","v":0},{"$f":"IF(S92=0,Artigos!B33,IF(S92=1,Artigos!B69,0))","v":0}]
[null,"SOMA TOTAL →",null,{"$f":"SUM(D95:E96)","v":0},null,null,null,null,null,null,null,{"$f":"SUM(J95:M96)","v":0},null,null,null,null,null,null,null,null,null,null,null,null,null,{"$f":"'Modelo 3'!D43","v":0}]
[null,"Continente ",null,"SOMA",{"$f":"SUM(D97)","v":0},null,{"$f":"IF(T92=1,E98,)","v":0},null,{"$f":"SUM(L97)","v":0},null,{"$f":"IF(T92=1,I98,)","v":0},null,null,"T. Separado",null,null,"T. Separado",null,null,null,null,null,null,null,null,{"$f":"'Modelo 3'!E43","v":0}]
[null,"Açores ",null,"SOMA",{"$f":"IF(E98<0,0,E98)","v":0},null,{"$f":"IF(T92=2,E99,)","v":0},null,{"$f":"IF(I98<0,0,I98)","v":0},null,{"$f":"IF(T92=2,I99,)","v":0},null,"SP A→",{"$f":"SUM(D93)","v":0},null,"SP B→",{"$f":"SUM(H93)","v":0},null,"← Quociente dos rendimentos de anos anteriores",null,null,null,null,null,null,{"$f":"'Modelo 3'!F43","v":0}]
[null,"Madeira",null,"SOMA",{"$f":"IF(E98<0,0,E98)","v":0},null,{"$f":"IF(T92=3,E100,)","v":0},null,{"$f":"IF(I98<0,0,I98)","v":0},null,{"$f":"IF(T92=3,I100,)","v":0},null,"SP A→",{"$f":"SUM(F93)","v":0},null,"SP B→",{"$f":"SUM(J93)","v":0},null,"← Imposto correspondente a rendimentos de anos anteriores"]
[null,{"$f":"IF(E98<0,0,SUM(G98:H100))","v":0},null,"← Quociente dos rendimentos de anos anteriores"]
[null,{"$f":"IF(I98<0,0,SUM(K98:L100))","v":0},null,"← Imposto correspondente a rendimentos de anos anteriores"]
[]
[]
[]
[]
[]
[]
[null,"FIM"]

{"sheet":"Anexo G","index":6,"n_rows":132,"n_cols":26,"rows_kept":132,"cut":false,"hidden":false,"merged":[[6,7,6,10],[17,17,17,18],[38,10,38,11],[94,7,94,8],[94,9,94,10],[76,1,76,2],[15,1,15,6],[16,15,16,16],[16,17,16,18],[18,15,18,16],[18,17,18,18],[19,15,19,16],[19,17,19,18],[20,15,20,16],[20,17,20,18],[69,6,69,7],[70,6,70,7],[71,6,71,7],[69,8,69,9],[70,8,70,9],[71,8,71,9],[74,1,74,2],[74,5,74,6],[74,8,74,9],[75,1,75,2],[67,1,67,2],[68,6,68,7],[68,8,68,9],[72,6,72,7],[75,5,75,6],[75,8,75,9],[72,1,72,2],[72,8,72,9],[73,1,73,2],[73,5,73,6],[73,8,73,9],[122,1,122,2],[123,1,123,2],[114,9,114,10],[108,1,108,2],[109,1,109,2],[110,1,110,2],[111,1,111,2],[108,5,108,6],[109,5,109,6],[110,5,110,6],[121,1,121,2],[121,4,121,5],[121,6,121,7],[121,8,121,9],[121,10,121,11],[108,8,108,9],[109,8,109,9],[110,8,110,9],[114,1,114,2],[114,3,114,4],[120,1,120,2],[120,13,120,14],[120,16,120,17],[117,3,117,4],[117,5,117,6],[117,7,117,8],[117,9,117,10],[114,5,114,6],[114,7,114,8],[121,13,121,14],[121,16,121,17],[120,4,120,5],[120,6,120,7],[120,8,120,9],[120,10,120,11],[117,22,117,23],[118,1,118,2],[118,3,118,4],[118,11,118,12],[119,1,119,2],[119,4,119,5],[119,6,119,7],[119,8,119,9],[119,10,119,11],[119,13,119,14],[119,16,119,17],[117,11,117,12],[117,13,117,14],[117,15,117,16],[117,17,117,18],[117,19,117,20],[117,1,117,2],[115,22,115,23],[115,24,115,25],[116,1,116,2],[116,3,116,4],[116,5,116,6],[116,7,116,8],[116,9,116,10],[116,11,116,12],[116,13,116,14],[116,15,116,16],[116,17,116,18],[116,19,116,20],[116,22,116,23],[116,24,116,25],[115,1,115,2],[115,13,115,14],[115,15,115,16],[115,17,115,18],[115,19,115,20],[103,1,104,2],[106,1,107,2],[102,10,102,11],[102,1,102,2],[96,8,96,9],[97,8,97,9],[98,8,98,9],[97,11,97,12],[98,11,98,12],[96,11,96,12],[105,4,105,5],[105,6,105,7],[94,5,94,6],[96,1,96,2],[97,1,97,2],[98,1,98,2],[99,1,99,2],[96,5,96,6],[97,5,97,6],[98,5,98,6],[91,1,91,2],[92,1,92,2],[93,1,93,2],[95,1,95,2],[94,3,94,4],[87,1,87,2],[88,1,88,2],[84,1,84,2],[84,6,84,7],[84,8,84,9],[85,5,85,6],[86,5,86,6],[87,5,87,6],[85,8,85,9],[86,8,86,9],[87,8,87,9],[79,1,79,2],[80,6,80,7],[80,8,80,9],[85,1,85,2],[86,1,86,2],[53,14,53,16],[53,17,53,19],[51,1,51,2],[52,1,52,2],[53,6,53,7],[53,8,53,9],[55,16,56,16],[59,14,59,15],[55,18,56,18],[55,19,56,19],[59,17,59,18],[64,1,64,2],[61,5,61,6],[62,5,62,6],[63,5,63,6],[55,15,56,15],[61,8,61,9],[62,8,62,9],[63,8,63,9],[24,15,24,18],[10,17,10,18],[11,17,11,18],[12,17,12,18],[13,17,13,18],[38,4,38,5],[38,7,38,8],[30,15,30,16],[31,15,31,16],[30,17,30,18],[31,17,31,18],[25,15,25,16],[26,15,26,16],[27,15,27,16],[28,15,28,16],[29,15,29,16],[25,17,25,18],[26,17,26,18],[27,17,27,18],[28,17,28,18],[29,17,29,18],[17,12,17,13],[17,15,17,16],[61,1,61,2],[62,1,62,2],[63,1,63,2],[0,20,1,20],[3,1,3,6],[22,1,22,6],[5,15,5,16],[10,15,10,16],[11,15,11,16],[12,15,12,16],[13,15,13,16],[5,17,5,18],[6,15,6,18],[7,15,7,16],[8,15,8,16],[9,15,9,16],[7,17,7,18],[8,17,8,18],[9,17,9,18],[38,1,38,2],[25,12,25,13],[29,14,30,14],[23,15,23,16],[23,17,23,18]]}
[]
[]
[]
[null,"QUADRO 4"]
[null,"ALIENAÇÃO ONEROSA DE DIREITOS REAIS SOBRE BENS IMÓVEIS"]
[null,"VENDA DE IMÓVEIS - [Artigo 10.º, nº 1, al. a), do Código do IRS]  (Imóveis) ",null,null,null,null,null,null,null,null,null,null,null,null,"Campo","Sujeito Passivo A",null,"Sujeito Passivo B"]
[null,"A aquisição é o ato ou contrato de aquisição do imóvel",null,null,null,null,null,"Indique ali o ano de aquisição",null,null,null,"☞","Ano",{"$f":"'Modelo 3'!K118","v":"0"},"☞","Se vendeu algum imóvel, indique o Tipo aqui:"]
[null,"Realização  [É o valor da venda, a declarar no Anexo G do QUADRO 4]",null,null,null,null,null,null,null,null,null,null,null,null,4001,null,null,null,null,{"$f":"TEXT(B48,)","v":""}]
[null,"Aquisição  [É o valor da compra ou avaliação, a declarar no Anexo G QUADRO 4]",null,null,null,null,null,null,null,null,null,null,null,"Veja aqui"]
[null,"Despesas e encargos  [Os encargos com a valorização dos bens, comprovadamente realizados nos últimos 12 anos art.º 51.º do CIRS]"]
[null,"Valor total em dívida"]
[null,"Valor que pretende reinvestir ou que já reinvestiu  [Habitação própria e permanente]"]
[null,"Valor do empréstimo a amortizar"]
[null,"Perdas a reportar do exercício de 2017 a deduzir ao rendimento de 2018  [Veja a Demonstração de Liquidação de IRS do exercício de 2017, enviada pela AT]"]
[]
[null," QUADRO 6"]
[null,"ALIENAÇÃO ONEROSA DA PROPRIEDADE INTELECTUAL [art.º 10.º, n.º 1, al. c), do CIRS (Propriedade Intelectual)",null,null,null,null,null,null,null,null,null,null,null,null,"Campo","Sujeito Passivo A",null,"Sujeito Passivo B"]
[null,"Os sujeitos passivos optam pelo englobamento dos rendimentos da categoria G, inscritos no Quadro 6  ? ",null,null,null,null,null,null,null,null,null,null,"Indique ali a",null,"☞","Opção",null,{"$f":"P18","v":"Opção"}]
[null,"Valor de realização  [Venda]                                  ",null,null,null,null,null,null,null,null,null,null,null,null,60001]
[null,"Valor de aquisição  [Compra]"]
[null,"Despesas e encargos  "]
[]
[null," QUADRO 9 e 9A"]
[null,"INCREMENTOS PATRIMONIAIS  - [Artigo 10.º, nº 1, al. b), do Código do IRS]  (Valores Mobiliários)",null,null,null,null,null,null,null,null,null,null,null,null,"Campo","Sujeito Passivo A",null,"Sujeito Passivo B"]
[null,"Indique ali  o tipo de rendimento ",null,null,null,null,null,null,null,null,null,null,null,null,"☞","Indique aqui o tipo:"]
[null,"Os sujeitos passivos optam pelo englobamento dos rendimentos da categoria G, inscritos no Quadro 9  ? ",null,null,null,null,null,null,null,null,null,null,"Indique ali a",null,"☞","Opção",null,{"$f":"P26","v":"Opção"}]
[null,"Valor de realização  [Venda]                                  ",null,null,null,null,null,null,null,null,null,null,null,null,9001]
[null,"Valor de aquisição  [Compra]"]
[null,"Despesas e encargos  [Comissões alínea b) do art.º 51.º do CIRS]"]
[null,"Incrementos patrimoniais relativos a anos anteriores",null,null,null,null,null,null,null,null,null,null,null,null,"Quadro \n14A"]
[null,"Indique o N.º de anos"]
[null,"Perdas a reportar do exercício de 2017 a deduzir ao rendimento de 2018  [Veja a Demonstração de Liquidação de IRS do exercício de 2017, enviada pela AT]"]
[]
[]
[]
[]
[null,"INICIO"]
[]
[null,"Venda de imóveis Anexo G Tipo",null,null,"Valores Mobiliários  Anexo G SP A",null,null,"Opção pelo englobamento da cat. G \nValores mobiliários SP A ",null,null,"Opção pelo englobamento da cat. G \nValores mobiliários SP A "]
[null,"Se vendeu algum imóvel, indique o Tipo aqui:",1,null,"Indique aqui o tipo:",1,null,"Opção",1,null,"Opção",1]
[null,"Habitação",2,null,"Ações",2,null,"Sim",2,null,"Sim",2]
[null,"Terreno rústico",3,null,"Quotas",3,null,"Não",3,null,"Não",3]
[null,"Terreno para construção",4,null,"Obrigações e outros títulos de dívida",4,null,null,{"$f":"VLOOKUP(P26,H40:I42,2,FALSE)","v":1},null,null,{"$f":"VLOOKUP(P18,K40:L42,2,FALSE)","v":1}]
[null,"Outros",5,null,"Outros valores mobiliários",5]
[null,null,{"$f":"VLOOKUP(P7,B40:C44,2,FALSE)","v":1},null,"Quotas-Mais valias art.º 43º  n.º 3 do CIRS (Quadro 9A)",6]
[null,null,null,null,null,{"$f":"VLOOKUP(P25,E40:F45,2,FALSE)","v":1}]
[null,{"$f":"IF(P8+R8+L98+L99+P19+R19+P27+R27=0,\"➤\",IF(P8+R8+L98+L99+P19+R19+P27+R27>=1,\"Vendeu\",))","v":"➤"}]
[null,{"$f":"IF(P8+R8>=1,\"← Só está preparado para um imóvel\",)","v":0}]
[]
[null,"CATEGORIA G",null,null,null,null,null,null,null,null,null,null,null,null,{"$f":"IF('Modelo 3'!E52=4,'Modelo 3'!D41,)","v":0},{"$f":"IF('Modelo 3'!E52=4,'Modelo 3'!E41,)","v":0},{"$f":"'Modelo 3'!F41","v":0},{"$f":"'Modelo 3'!G41","v":0},{"$f":"'Modelo 3'!H41","v":0},{"$f":"'Modelo 3'!I41","v":0}]
[null,"Art.º 9.º , 10.º do CIRS - Rendimentos da categoria G+Mais valias+valor divida+valor reinvestido",null,null,null,null,null,null,null,null,null,null,null,null,null,null,null,{"$f":"'Anexo A'!R46","v":1},{"$f":"IF(U51=TRUE,4,IF(U52=TRUE,1,IF(U53=TRUE,4,'Anexo A'!S46)))","v":1},null,{"$f":"'Modelo 3'!D43","v":0}]
[null,"T.  Separada →",null,null,null,null,{"$f":"IF(R51=1,O60,0)","v":0},null,{"$f":"IF(R51=1,R60,0)","v":0},null,null,null,null,null,null,null,null,null,null,null,{"$f":"'Modelo 3'!E43","v":0}]
[null,"Taxa →",null,null,null,null,null,null,null,null,null,null,null,null,null,null,null,null,null,null,{"$f":"'Modelo 3'!F43","v":0}]
[null,null,null,"Mais valias ",null,null,"Sujeito Passivo A ",null,"Sujeito Passivo B",null,"Reinvestimento",null,{"$f":"SUM(G58)","v":0},null,"Sujeito Passivo A ",null,null,"Sujeito Passivo B"]
[null,null,null,"Valor da Realização (Venda) ",null,null,{"$f":"IF(M54>=1,P8,0)","v":0},null,{"$f":"IF(M54>=1,R8,0)","v":0},null,"Valor total em dívida",null,null,null,{"$f":"G55","v":0},{"$f":"P9","v":0},{"$f":"IF(P55>=O55,0,(O55-(P55*G58)))-G57","v":0},{"$f":"I55","v":0},{"$f":"R9","v":0},{"$f":"IF(S55>=R55,0,(R55-(S55*I58)))-I57","v":0}]
[null,null,null,"Valor da Aquisição (Compra) ",null,null,{"$f":"IF(M54>=1,P9,0)","v":0},null,{"$f":"IF(M54>=1,R9,0)","v":0},null,"Valor do empréstimo a amortizar ",null,null,null,{"$f":"IF(M54>=0.001,P13,0)","v":0},{"$f":"IF(O57<=1,O55,IF(O57>=1,O55-O56,))","v":0},{"$f":"IF(O55=0,0,IF(O57=0,O56/P56,IF(O57>=1,O57/P56,0)))","v":0},{"$f":"IF(M54>=0.001,R13,0)","v":0},{"$f":"IF(R57<=1,R55,IF(R57>=1,R55-R56,))","v":0},{"$f":"IF(R55=0,0,IF(R57=0,R56/S56,IF(R57>=1,R57/S56,0)))","v":0}]
[null,null,null,"Despesas/encargos",null,null,{"$f":"P10","v":0},null,{"$f":"R10","v":0},null,"Proporção reinvestida ",null,null,null,{"$f":"IF(M54>=0.001%,P12,0)","v":0},null,null,{"$f":"IF(M54>=0.001%,R12,0)","v":0}]
[null,null,null,"Desvalorização da moeda ",null,null,{"$f":"N7","v":"0"},null,{"$f":"N7","v":"0"},null,"Proporção da mais-valia reinvestida ",null,null,null,{"$f":"Q55","v":0},null,null,{"$f":"T55","v":0}]
[null,null,null,{"$f":"IF(G60<=0%,\"Menos valias imobiliárias\",IF(G60>0.01%,\"Mais valias imobiliárias;\"))","v":"Mais valias imobiliárias;"},null,null,{"$f":"(G55-G56*G58-G57)","v":0},null,{"$f":"(I55-I56*I58-I57)","v":0},null,"Mais-valia sujeita a imposto",null,null,null,{"$f":"IF(O58<1,0,O58)","v":0},{"$f":"O59*Q56","v":0},{"$f":"O59-P59","v":0},{"$f":"IF(R58<1,0,R58)","v":0},{"$f":"R59*T56","v":0},{"$f":"R59-S59","v":0}]
[null,null,null,"Isenção ",null,null,0.5,null,0.5,null,null,null,"SOMA TOTAL →",null,{"$f":"Q59*G60","v":0},null,null,{"$f":"T59*I60","v":0}]
[null,null,null,"Mais valia final →",null,null,{"$f":"IF(G59<0,0,G59*G60)","v":0},null,{"$f":"IF(I59<0,0,I59*I60)","v":0}]
[null,"Continente (RB)",null,"SOMA",{"$f":"SUM(O60+R60)","v":0},{"$f":"IF(S51=1,E62,)","v":0},null,null,"T. Separado"]
[null,"Açores ",null,"SOMA",{"$f":"IF(E62<0,0,E62)","v":0},{"$f":"IF(S51=2,E63,)","v":0},null,"SP A→",{"$f":"IF(S51>=4,0,IF(R51=1,G52,))","v":0}]
[null,"Madeira",null,"SOMA",{"$f":"IF(E62<0,0,E62)","v":0},{"$f":"IF(S51=3,E64,)","v":0},null,"SP B→",{"$f":"IF(S51>=4,0,IF(R51=1,I52,))","v":0}]
[null,{"$f":"IF(E62<0,0,SUM(F62+F63+F64))","v":0},null,"← Rendimento bruto"]
[]
[null,"Art.-º 10.º, n.º 1, al. c), do CIRS - Alienação Onorosa da propriedade Intelectual",null,null,null,null,null,null,null,null,null,null,null,null,null,null,null,{"$f":"'Anexo A'!R46","v":1},{"$f":"IF(S68=TRUE,4,IF(S69=TRUE,1,IF(S70=TRUE,4,'Anexo A'!S46)))","v":1},0.5]
[null,"T.  Separada →",null,null,null,null,{"$f":"IF(R67=1,G73,0)","v":0},null,{"$f":"IF(R67=1,I73,0)","v":0},null,null,null,null,null,null,null,null,null,{"$f":"'Modelo 3'!D43","v":0}]
[null,null,null,null,null,null,"Sujeito Passivo A ",null,"Sujeito Passivo B",null,null,null,null,null,null,null,null,null,{"$f":"'Modelo 3'!E43","v":0}]
[null,null,null,"Valor da Realização (Venda) ",null,null,{"$f":"IF(L43=3,0,P19)","v":0},null,{"$f":"IF(L43=3,0,R19)","v":0},null,null,null,null,null,null,null,null,null,{"$f":"'Modelo 3'!F43","v":0}]
[null,null,null,"Valor da Aquisição (Compra) ",null,null,{"$f":"IF(L43=3,0,P20)","v":0},null,{"$f":"IF(L43=3,0,R20)","v":0}]
[null,null,null,"Despesas/encargos",null,null,{"$f":"P21","v":0},null,{"$f":"R21","v":0}]
[null,"SOMA TOTAL →",null,"Mais valia final →",null,null,{"$f":"(G70-G71-G72)*T67","v":0},null,{"$f":"(I70-I71-I72)*T67","v":0}]
[null,"Continente (RB)",null,"SOMA",{"$f":"SUM(G73+I73)","v":0},{"$f":"IF(S67=1,E74,)","v":0},null,null,"T. Separado"]
[null,"Açores ",null,"SOMA",{"$f":"IF(E74<0,0,E74)","v":0},{"$f":"IF(S67=2,E75,)","v":0},null,"SP A→",{"$f":"IF(S67>=4,0,IF(R67=1,G68,))","v":0}]
[null,"Madeira",null,"SOMA",{"$f":"IF(E74<0,0,E74)","v":0},{"$f":"IF(S67=3,E76,)","v":0},null,"SP B→",{"$f":"IF(S67>=4,0,IF(R67=1,I68,))","v":0}]
[null,{"$f":"IF(E74<0,0,SUM(F74+F75+F76))","v":0},null,"← Rendimento bruto"]
[]
[null,"Art.º 9.º , 10.º do CIRS - Rendimentos da categoria G+Mais valias de Ações",null,null,null,null,null,null,null,null,null,null,null,null,null,null,null,{"$f":"'Anexo A'!R46","v":1},{"$f":"IF(S80=TRUE,4,IF(S81=TRUE,1,IF(S82=TRUE,4,'Anexo A'!S46)))","v":1}]
[null,"T.  Separada →",null,null,null,null,{"$f":"IF(R79=1,G85,0)","v":0},null,{"$f":"IF(R79=1,I85,0)","v":0},null,null,null,null,null,null,null,null,null,{"$f":"'Modelo 3'!D43","v":0}]
[null,null,null,null,null,null,"Sujeito Passivo A ",null,"Sujeito Passivo B",null,null,null,null,null,null,null,null,null,{"$f":"'Modelo 3'!E43","v":0}]
[null,null,null,"Valor da Realização (Venda) ",null,null,{"$f":"IF(I43=3,0,P27)","v":0},{"$f":"F46","v":1},{"$f":"IF(I43=3,0,R27)","v":0},{"$f":"H82","v":1},null,null,null,null,null,null,null,null,{"$f":"'Modelo 3'!F43","v":0}]
[null,null,null,"Valor da Aquisição (Compra) ",null,null,{"$f":"IF(I43=3,0,P28)","v":0},null,{"$f":"IF(I43=3,0,R28)","v":0}]
[null,null,null,"Despesas/encargos",null,null,{"$f":"P29","v":0},null,{"$f":"R29","v":0}]
[null,"SOMA TOTAL →",null,"Mais valia final →",null,null,{"$f":"IF(H82=6,IF(G82-G83-G84<0,0,G82-G83-G84)/2,IF(G82-G83-G84<0,0,G82-G83-G84))","v":0},null,{"$f":"IF(J82=6,IF(I82-I83-I84<0,0,I82-I83-I84)/2,IF(I82-I83-I84<0,0,I82-I83-I84))","v":0}]
[null,"Continente (RB)",null,"SOMA",{"$f":"SUM(G85+I85)","v":0},{"$f":"IF(S79=1,E86,)","v":0},null,null,"T. Separado"]
[null,"Açores ",null,"SOMA",{"$f":"IF(E86<0,0,E86)","v":0},{"$f":"IF(S79=2,E87,)","v":0},null,"SP A→",{"$f":"IF(S79>=4,0,IF(R79=1,G80,))","v":0}]
[null,"Madeira",null,"SOMA",{"$f":"IF(E86<0,0,E86)","v":0},{"$f":"IF(S79=3,E88,)","v":0},null,"SP B→",{"$f":"IF(S79>=4,0,IF(R79=1,I80,))","v":0}]
[null,{"$f":"IF(E86<0,0,SUM(F86+F87+F88))","v":0},null,"← Rendimento bruto"]
[]
[null,"Art.º 9.º , 10.º do CIRS - Rendimentos da categoria G+Mais valias de Ações (Tributação Autónoma)",null,null,null,null,null,null,null,null,null,null,null,null,null,null,null,{"$f":"'Anexo A'!R46","v":1},{"$f":"IF(S92=TRUE,4,IF(S93=TRUE,1,IF(S94=TRUE,4,'Anexo A'!S46)))","v":1}]
[null,"T.  Separada →",null,{"$f":"IF(R91=1,D96,0)","v":0},null,{"$f":"IF(R91=1,F96,0)","v":0},null,{"$f":"IF(R91=1,H96,0)","v":0},{"$f":"IF(R91=1,J96,0)","v":0},null,null,null,null,null,null,null,null,null,{"$f":"'Modelo 3'!D43","v":0}]
[null,"Rendimento Bruto →",null,{"$f":"P27-P28-P29","v":0},null,{"$f":"R27-R28-R29","v":0},null,{"$f":"(P19-P20-P21)","v":0},{"$f":"R19-R20-R21","v":0},null,null,null,null,null,null,null,null,null,{"$f":"'Modelo 3'!E43","v":0}]
[null,"Taxa →",null,{"$f":"'Modelo 3'!P36","v":0.28000000000000003},null,null,null,null,null,null,null,null,null,{"$f":"'Modelo 3'!T36","v":0.28000000000000003},null,null,null,null,{"$f":"'Modelo 3'!F43","v":0}]
[null,null,null,"Sujeito Passivo A ",null,"Sujeito Passivo B",null,"Sujeito Passivo A ",null,"Sujeito Passivo B"]
[null,"SOMA TOTAL →",null,{"$f":"IF(I43=3,D93*D94,0)","v":0},null,{"$f":"IF(I43=3,F93*D94,0)","v":0},null,{"$f":"IF(L43=3,H93*D94,0)","v":0},null,{"$f":"IF(L43=3,I93*D94,0)","v":0}]
[null,"Continente (TA)",null,"SOMA",{"$f":"SUM(D96:J96)","v":0},{"$f":"IF(S91=1,E97,)","v":0},null,null,"T. Separado",null,null,"Não residentes"]
[null,"Açores ",null,"SOMA",{"$f":"IF(E97<0,0,E97)","v":0},{"$f":"IF(S91=2,E98,)","v":0},null,"SP A→",{"$f":"IF(S91>=4,0,IF(R91=1,D92+H92,))","v":0},null,"SP A→",{"$f":"IF(S91>=4,O98,)","v":0},null,{"$f":"IF(G73+G59+G85<1,0,G73+G59+G85)","v":0},{"$f":"N98*N94","v":0}]
[null,"Madeira",null,"SOMA",{"$f":"IF(E97<0,0,E97)","v":0},{"$f":"IF(S91=3,E98,)","v":0},null,"SP B→",{"$f":"IF(S91>=4,0,IF(R91=1,F92+I92,))","v":0},null,"SP B→",{"$f":"IF(S91>=4,O99,)","v":0},null,{"$f":"IF(I73+I59+I85<1,0,I73+I59+I85)","v":0},{"$f":"N99*N94","v":0}]
[null,{"$f":"IF(E97<0,0,SUM(F97+F98+F99))","v":0},null,"← Tributação Autónoma"]
[]
[null," Reporte de prejuízos da categoria G",null,null,null,null,null,null,null,null,null,null,null,null,null,null,null,{"$f":"'Anexo A'!R46","v":1},{"$f":"IF(S103=TRUE,4,IF(S104=TRUE,1,IF(S105=TRUE,4,'Anexo A'!S46)))","v":1}]
[null,"T.  Separada →",null,null,{"$f":"IF(R102=1,E107+E108,0)","v":0},null,{"$f":"IF(R102=1,G107+G108,0)","v":0},null,null,null,null,null,null,null,null,null,null,null,{"$f":"'Modelo 3'!D43","v":0}]
[null,"Rendimento Bruto →",null,"Imóveis →",{"$f":"IF(G59>=1,P14,)","v":0},null,{"$f":"IF(I59>=1,R14,)","v":0},null,null,null,null,null,null,null,null,null,null,null,{"$f":"'Modelo 3'!E43","v":0}]
[null,null,null,"Ações →",{"$f":"IF(G85>=1,P32,)","v":0},null,{"$f":"IF(I85>=1,R32,)","v":0},null,null,null,null,null,null,null,null,null,null,null,{"$f":"'Modelo 3'!F43","v":0}]
[null,null,null,null,"Sujeito Passivo A ",null,"Sujeito Passivo B"]
[null,"SOMA TOTAL →",null,null,{"$f":"IF(E104>F107,F107,E104)","v":0},{"$f":"G61","v":0},{"$f":"IF(G104>H107,H107,G104)","v":0},{"$f":"I61","v":0}]
[null,null,null,null,{"$f":"IF(E105>F108,F108,E105)","v":0},{"$f":"G85","v":0},{"$f":"IF(G105>H108,H108,G105)","v":0},{"$f":"I85","v":0}]
[null,"Continente (RP)",null,"SOMA",{"$f":"SUM(E107:E108,G107:G108)","v":0},{"$f":"IF(S102=1,E109,)","v":0},null,null,"T. Separado"]
[null,"Açores ",null,"SOMA",{"$f":"IF(E109<0,0,E109)","v":0},{"$f":"IF(S91=2,E110,)","v":0},null,"SP A→",{"$f":"IF(S102>=4,0,IF(R102=1,E103,))","v":0}]
[null,"Madeira",null,"SOMA",{"$f":"IF(E109<0,0,E109)","v":0},{"$f":"IF(S91<0,0,E111)","v":0},null,"SP B→",{"$f":"IF(S102>=4,0,IF(R102=1,G103,))","v":0}]
[null,{"$f":"IF(E109<0,0,SUM(F109+F110+F111))","v":0},null,"← Reporte de prejuízos Fiscais"]
[]
[null,"Art.º 74.º do CIRS - Rendimentos produzidos em anos anteriores Cat. G",null,null,null,null,null,null,null,null,null,null,{"$f":"Artigos!F51","v":0},null,null,null,null,null,{"$f":"'Anexo A'!R46","v":1},{"$f":"IF(Z119=TRUE,4,IF(Z120=TRUE,1,IF(Z121=TRUE,4,'Anexo A'!S46)))","v":1}]
[null,"T.  Separada →",null,{"$f":"IF(S114=1,D117,0)","v":0},null,{"$f":"IF(S114=1,J117+L117,0)","v":0},null,{"$f":"IF(S114=1,D118,0)","v":0},null,{"$f":"IF(S114=1,J118+L118,0)","v":0},null,null,{"$f":"Artigos!F69","v":0}]
[null,"Nº de Anos →",null,null,{"$f":"P31+1","v":1},null,{"$f":"R31+1","v":1},null,null,null,null,null,null,"Rendimento Bruto",null,"Dedução Específica",null,"Rendimento Coletável",null,"Rendi. Anos Anteriores",null,"TAXA","Parcela a Abater",null,{"$f":"D117*H117","v":0}]
[null,"Sujeito Passivo A  →",null,{"$f":"IF(N117<1,0,(T117*R117)/N117*(E116-1)/E116)","v":0},null,{"$f":"(R117-D117+0)","v":0},null,{"$f":"(F117*V117)-W117","v":0},null,{"$f":"IF(S114=1,0,IF(N117<1,0,IF(R117<1,0,(H117*D117)/F117)))","v":0},null,{"$f":"IF(Y116<=0,0,IF(S114=0,0,Y116/M114))","v":0},null,{"$f":"IF('Modelo 3'!F52=4,0,G59+G85)","v":0},null,0,null,{"$f":"IF('Modelo 3'!F52=4,0,IF(N117>P117,N117-P117,0))","v":0},null,{"$f":"SUM(P30)","v":0},null,{"$f":"IF(S114=0,Artigos!B32,IF(S114=1,Artigos!B50,0))","v":0},{"$f":"IF(S114=0,Artigos!B33,IF(S114=1,Artigos!B51,0))","v":0},null,{"$f":"D118*H118","v":0}]
[null,"Sujeito Passivo B  →",null,{"$f":"IF(N118<1,0,(T118*R118)/N118*(G116-1)/G116)","v":0},null,{"$f":"(R118-D118+0)","v":0},null,{"$f":"(F118*V118)-W118","v":0},null,{"$f":"IF(S114=1,0,IF(N118<1,0,IF(R118<1,0,(H118*D118)/F118)))","v":0},null,{"$f":"IF(Y117<=0,0,IF(S114=0,0,Y117/M115))","v":0},null,{"$f":"IF('Modelo 3'!F52=4,0,I59+I85)","v":0},null,0,null,{"$f":"IF('Modelo 3'!F52=4,0,IF(N118>P118,N118-P118,0))","v":0},null,{"$f":"SUM(R30)","v":0},null,{"$f":"IF(S114=0,Artigos!B32,IF(S114=1,Artigos!B68,0))","v":0},{"$f":"IF(S114=0,Artigos!B33,IF(S114=1,Artigos!B69,0))","v":0}]
[null,"SOMA TOTAL →",null,{"$f":"SUM(D117:E118)","v":0},null,null,null,null,null,null,null,{"$f":"SUM(J117:M118)","v":0},null,null,null,null,null,null,null,null,null,null,null,null,null,{"$f":"'Modelo 3'!D43","v":0}]
[null,"Continente ",null,"SOMA",{"$f":"SUM(D119)","v":0},null,{"$f":"IF(T114=1,E120,)","v":0},null,{"$f":"SUM(L119)","v":0},null,{"$f":"IF(T114=1,I120,)","v":0},null,null,"T. Separado",null,null,"T. Separado",null,null,null,null,null,null,null,null,{"$f":"'Modelo 3'!E43","v":0}]
[null,"Açores ",null,"SOMA",{"$f":"IF(E120<0,0,E120)","v":0},null,{"$f":"IF(T114=2,E121,)","v":0},null,{"$f":"IF(I120<0,0,I120)","v":0},null,{"$f":"IF(T114=2,I121,)","v":0},null,"SP A→",{"$f":"SUM(D115)","v":0},null,"SP B→",{"$f":"SUM(H115)","v":0},null,"← Quociente dos rendimentos de anos anteriores",null,null,null,null,null,null,{"$f":"'Modelo 3'!F43","v":0}]
[null,"Madeira",null,"SOMA",{"$f":"IF(E120<0,0,E120)","v":0},null,{"$f":"IF(T114=3,E122,)","v":0},null,{"$f":"IF(I120<0,0,I120)","v":0},null,{"$f":"IF(T114=3,I122,)","v":0},null,"SP A→",{"$f":"SUM(F115)","v":0},null,"SP B→",{"$f":"SUM(J115)","v":0},null,"← Imposto correspondente a rendimentos de anos anteriores"]
[null,{"$f":"IF(E120<0,0,SUM(G120:H122))","v":0},null,"← Quociente dos rendimentos de anos anteriores"]
[null,{"$f":"IF(I120<0,0,SUM(K120:L122))","v":0},null,"← Imposto correspondente a rendimentos de anos anteriores"]
[]
[]
[]
[]
[]
[]
[]
[null,"FIM"]

{"sheet":"Anexo H","index":7,"n_rows":350,"n_cols":25,"rows_kept":350,"cut":false,"hidden":false,"merged":[[100,15,100,16],[342,1,342,2],[343,1,343,2],[342,4,342,5],[343,4,343,5],[342,7,342,8],[343,7,343,8],[344,1,344,2],[338,1,338,2],[339,1,339,2],[340,1,340,2],[341,1,341,2],[339,3,339,4],[339,6,339,7],[339,9,339,10],[338,3,338,4],[338,6,338,7],[338,9,338,10],[325,1,325,2],[326,1,326,2],[328,1,328,2],[329,1,329,2],[327,3,327,4],[327,5,327,6],[330,1,330,2],[331,1,331,2],[334,1,334,2],[335,1,335,2],[336,1,336,2],[337,1,337,2],[327,7,327,8],[311,1,311,2],[317,1,317,2],[312,3,312,4],[312,5,312,6],[312,7,312,8],[318,1,318,2],[319,1,319,2],[320,1,320,2],[321,1,321,2],[318,5,318,6],[319,5,319,6],[320,5,320,6],[318,8,318,9],[319,8,319,9],[320,8,320,9],[306,1,306,2],[307,1,307,2],[304,5,304,6],[305,5,305,6],[306,5,306,6],[304,8,304,9],[305,8,305,9],[306,8,306,9],[310,1,310,2],[303,1,303,2],[304,1,304,2],[305,1,305,2],[296,3,296,4],[296,5,296,6],[296,7,296,8],[293,1,293,2],[294,1,294,2],[295,1,295,2],[286,1,286,2],[287,1,287,2],[288,1,288,2],[289,1,289,2],[286,5,286,6],[287,5,287,6],[288,5,288,6],[286,8,286,9],[287,8,287,9],[288,8,288,9],[280,1,280,2],[281,1,281,2],[282,1,282,2],[283,1,283,2],[284,1,284,2],[285,1,285,2],[284,3,284,4],[284,5,284,6],[284,7,284,8],[272,9,272,10],[274,1,274,2],[275,1,275,2],[276,1,276,2],[277,1,277,2],[274,5,274,6],[275,5,275,6],[276,5,276,6],[274,8,274,9],[275,8,275,9],[276,8,276,9],[268,1,268,2],[269,1,269,2],[270,1,270,2],[271,1,271,2],[272,1,272,2],[273,1,273,2],[272,3,272,4],[272,5,272,6],[272,7,272,8],[15,18,15,22],[262,1,262,2],[263,1,263,2],[264,1,264,2],[265,1,265,2],[262,5,262,6],[263,5,263,6],[264,5,264,6],[262,8,262,9],[263,8,263,9],[264,8,264,9],[260,9,260,10],[260,11,260,12],[260,13,260,14],[256,14,256,15],[257,17,258,17],[256,1,256,2],[257,1,257,2],[258,1,258,2],[259,1,259,2],[260,1,260,2],[261,1,261,2],[260,3,260,4],[260,5,260,6],[260,7,260,8],[249,1,249,2],[250,1,250,2],[251,1,251,2],[252,1,252,2],[249,5,249,6],[250,5,250,6],[251,5,251,6],[249,8,249,9],[250,8,250,9],[251,8,251,9],[244,1,244,2],[245,1,245,2],[246,1,246,2],[247,1,247,2],[248,1,248,2],[247,3,247,4],[247,5,247,6],[247,7,247,8],[247,9,247,10],[236,9,236,10],[238,1,238,2],[239,1,239,2],[240,1,240,2],[241,1,241,2],[238,5,238,6],[239,5,239,6],[240,5,240,6],[238,8,238,9],[239,8,239,9],[240,8,240,9],[232,1,232,2],[233,1,233,2],[234,1,234,2],[235,1,235,2],[236,1,236,2],[237,1,237,2],[236,3,236,4],[236,5,236,6],[236,7,236,8],[226,1,226,2],[227,1,227,2],[228,1,228,2],[229,1,229,2],[226,5,226,6],[227,5,227,6],[228,5,228,6],[226,8,226,9],[227,8,227,9],[228,8,228,9],[221,1,221,2],[222,1,222,2],[223,1,223,2],[224,1,224,2],[225,1,225,2],[224,3,224,4],[224,5,224,6],[224,7,224,8],[224,9,224,10],[216,1,216,2],[213,5,213,6],[214,5,214,6],[215,5,215,6],[213,8,213,9],[214,8,214,9],[215,8,215,9],[219,1,219,2],[220,1,220,2],[213,1,213,2],[214,1,214,2],[215,1,215,2],[153,1,153,2],[154,1,154,2],[155,1,155,2],[148,1,148,2],[149,1,149,2],[150,1,150,2],[147,5,147,6],[148,5,148,6],[149,5,149,6],[93,11,93,12],[93,13,93,14],[93,15,93,16],[93,17,93,18],[93,19,93,20],[86,8,86,9],[87,8,87,9],[88,8,88,9],[92,1,92,2],[93,1,93,2],[94,1,94,2],[93,3,93,4],[93,5,93,6],[93,7,93,8],[93,9,93,10],[83,1,83,2],[84,1,84,2],[85,1,85,2],[86,1,86,2],[87,1,87,2],[88,1,88,2],[89,1,89,2],[86,5,86,6],[87,5,87,6],[88,5,88,6],[52,19,52,20],[52,21,52,22],[52,23,52,24],[53,17,53,18],[53,19,53,20],[53,21,53,22],[53,23,53,24],[48,17,48,18],[48,19,48,20],[48,21,48,22],[48,23,48,24],[51,19,51,20],[51,21,51,22],[51,23,51,24],[38,19,38,20],[38,21,38,22],[38,23,38,24],[37,24,37,30],[46,19,46,20],[46,21,46,22],[46,23,46,24],[47,17,47,18],[47,19,47,20],[47,21,47,22],[47,23,47,24],[44,23,44,24],[45,17,45,18],[45,19,45,20],[45,21,45,22],[45,23,45,24],[37,31,37,32],[40,19,40,20],[40,21,40,22],[40,23,40,24],[41,17,41,18],[41,19,41,20],[41,21,41,22],[41,23,41,24],[44,17,44,18],[44,19,44,20],[44,21,44,22],[42,17,42,18],[42,19,42,20],[42,21,42,22],[42,23,42,24],[43,17,43,18],[43,19,43,20],[43,21,43,22],[43,23,43,24],[39,17,39,18],[39,19,39,20],[39,21,39,22],[39,23,39,24],[38,17,38,18],[29,21,29,22],[30,21,30,22],[31,21,31,22],[32,21,32,22],[33,21,33,22],[34,21,34,22],[23,21,23,22],[24,21,24,22],[25,21,25,22],[26,21,26,22],[29,23,29,24],[30,23,30,24],[31,23,31,24],[32,23,32,24],[33,23,33,24],[34,23,34,24],[23,23,23,24],[24,23,24,24],[25,23,25,24],[26,23,26,24],[27,23,27,24],[28,23,28,24],[19,24,19,30],[29,19,29,20],[30,19,30,20],[31,19,31,20],[32,19,32,20],[33,19,33,20],[34,19,34,20],[33,17,33,18],[34,17,34,18],[29,17,29,18],[30,17,30,18],[31,17,31,18],[32,17,32,18],[23,19,23,20],[24,19,24,20],[25,19,25,20],[26,19,26,20],[27,19,27,20],[28,19,28,20],[27,17,27,18],[28,17,28,18],[27,21,27,22],[28,21,28,22],[20,19,20,20],[20,21,20,22],[20,23,20,24],[21,17,21,18],[22,17,22,18],[21,21,21,22],[22,21,22,22],[21,23,21,24],[22,23,22,24],[21,19,21,20],[22,19,22,20],[68,1,68,2],[68,4,68,5],[68,7,68,8],[68,10,68,11],[20,17,20,18],[23,17,23,18],[24,17,24,18],[25,17,25,18],[26,17,26,18],[62,1,62,2],[62,4,62,5],[36,1,36,6],[51,1,51,6],[53,1,53,15],[51,17,51,18],[47,1,47,15],[52,17,52,18],[41,1,41,15],[42,1,42,15],[40,1,40,15],[44,1,44,15],[40,17,40,18],[46,17,46,18],[17,14,17,15],[17,16,17,17],[13,14,13,15],[13,16,13,17],[14,14,14,15],[14,16,14,17],[16,14,16,15],[16,16,16,17],[3,1,3,6],[11,1,11,6],[15,1,15,12],[7,16,7,17],[5,14,5,15],[5,16,5,17],[6,14,6,15],[6,16,6,17],[7,14,7,15],[15,14,15,15],[15,16,15,17],[7,7,7,12],[14,8,14,12],[16,8,16,12],[95,1,95,2],[96,1,96,2],[97,1,97,2],[98,1,98,2],[95,5,95,6],[96,5,96,6],[97,5,97,6],[95,8,95,9],[96,8,96,9],[97,8,97,9],[105,9,105,10],[105,11,105,12],[101,15,101,16],[102,15,102,16],[107,1,107,2],[108,1,108,2],[109,1,109,2],[110,1,110,2],[107,5,107,6],[108,5,108,6],[109,5,109,6],[107,8,107,9],[108,8,108,9],[109,8,109,9],[101,1,101,2],[102,1,102,2],[103,1,103,2],[104,1,104,2],[105,1,105,2],[106,1,106,2],[105,3,105,4],[105,5,105,6],[105,7,105,8],[103,15,103,16],[113,1,113,2],[114,1,114,2],[115,1,115,2],[116,1,116,2],[117,1,117,2],[118,1,118,2],[117,3,117,4],[117,5,117,6],[117,7,117,8],[117,9,117,10],[119,1,119,2],[120,1,120,2],[121,1,121,2],[122,1,122,2],[119,5,119,6],[120,5,120,6],[121,5,121,6],[120,8,120,9],[121,8,121,9],[119,8,119,9],[125,1,126,2],[134,1,134,2],[135,1,135,2],[136,1,136,2],[137,1,137,2],[134,5,134,6],[135,5,135,6],[136,5,136,6],[135,8,135,9],[136,8,136,9],[131,3,131,4],[131,5,131,6],[131,7,131,8],[131,9,131,10],[134,8,134,9],[132,1,132,2],[127,1,127,2],[128,1,128,2],[140,1,140,2],[141,1,141,2],[142,1,142,2],[146,1,146,2],[147,1,147,2],[143,1,143,2],[144,1,144,2],[145,1,145,2],[129,1,129,2],[130,1,130,2],[156,1,156,2],[157,1,157,2],[158,1,158,2],[159,1,159,2],[158,3,158,4],[158,5,158,6],[166,1,166,2],[167,1,167,2],[168,1,168,2],[169,1,169,2],[170,1,170,2],[171,1,171,2],[170,3,170,4],[170,5,170,6],[158,7,158,8],[160,1,160,2],[161,1,161,2],[162,1,162,2],[163,1,163,2],[160,5,160,6],[161,5,161,6],[162,5,162,6],[160,8,160,9],[161,8,161,9],[162,8,162,9],[170,7,170,8],[170,9,170,10],[165,10,168,11],[173,1,173,2],[174,1,174,2],[175,1,175,2],[176,1,176,2],[173,5,173,6],[174,5,174,6],[175,5,175,6],[173,8,173,9],[174,8,174,9],[175,8,175,9],[179,1,179,2],[180,1,180,2],[181,1,181,2],[182,1,182,2],[183,1,183,2],[182,3,182,4],[182,5,182,6],[184,1,184,2],[185,1,185,2],[196,1,196,2],[186,1,186,2],[187,1,187,2],[184,5,184,6],[185,5,185,6],[186,5,186,6],[185,8,185,9],[186,8,186,9],[190,1,190,2],[191,1,191,2],[148,8,148,9],[149,8,149,9],[147,8,147,9],[145,3,145,4],[145,5,145,6],[145,7,145,8],[212,1,212,2],[212,6,212,7],[212,9,212,10],[202,1,202,2],[207,1,207,2],[197,1,197,2],[198,1,198,2],[199,1,199,2],[197,5,197,6],[198,5,198,6],[197,8,197,9],[198,8,198,9],[192,1,192,2],[193,1,193,2],[194,1,194,2],[195,1,195,2],[194,3,194,4],[194,5,194,6],[207,15,207,16],[207,12,207,14],[212,3,212,4],[207,3,207,5],[207,6,207,8],[207,9,207,11],[196,5,196,6],[184,8,184,9],[196,8,196,9],[212,12,212,13],[194,7,194,8],[194,9,194,10]]}
[]
[]
[]
[null,"QUADRO 6A "]
[null,"PENSÕES DE ALIMENTOS "]
[null,"DEDUÇÕES À COLETA  [Artigo 83.º-A do Código doIRS]",null,null,null,null,null,null,null,null,null,null,null,"Campo","Sujeito Passivo A",null,"Sujeito Passivo B"]
[null,"Os sujeitos passivos, estão obrigados a pagar pensões de alimentos a filhos por sentença ou acordo judicial ?",null,null,null,null,null,null,null,null,null,null,null,"☞","Indique aqui",null,"Indique aqui"]
[null,"Pensões de alimentos  - (art.º. 83.º-A do Código do IRS)  ",null,null,null,null,null,"[Indique ali o valor da pensão paga]",null,null,null,null,null,"☞"]
[null,{"$f":"TEXT(B78,)","v":""}]
[null,{"$f":"TEXT(B79,)","v":""}]
[]
[null,"QUADRO 6B"]
[null,"PLANOS DE POUPANÇA REFORMA (PPR) E REGIME PÚBLICO DE CAPITALIZAÇÃO"]
[null,"DEDUÇÕES À COLETA ",null,null,null,null,null,null,null,null,null,null,null,"Código","Sujeito Passivo A",null,"Sujeito Passivo B"]
[null,"Os sujeitos passivos, têm Planos Poupança Reforma PPR'S ? ",null,null,null,null,null,null,"Indique ali a idade dos sujeitos passivos",null,null,null,null,"☞","Indique a idade",null,"Indique a idade"]
[null,"Planos individuais de poupança-reforma - (n.º 2 do artigo 21.º do EBF) \nFundos de pensões, para regimes complementares de seg. social - (art.º 16.º do EBF) ",null,null,null,null,null,null,null,null,null,null,null,"601\n602",null,null,null,null,{"$f":"TEXT(B77,)","v":""}]
[null,"Os sujeito sassivos têm Regime Público de Capitalização ? ",null,null,null,null,null,null,"Indique ali a idade dos sujeitos passivos",null,null,null,null,"☞","Indique a idade ",null,"Indique a idade "]
[null,"Valores aplicados em contas individuais geridas em regime público de capitalização  - (art.º 17.º do EBF)",null,null,null,null,null,null,null,null,null,null,null,603]
[null,null,null,null,null,null,null,null,null,null,null,null,null,null,null,null,null,null,null,null,null,null,null,null,"Dependetes em gurada conjuta"]
[null,"BENEFÍCIOS FISCAIS E DESPESAS RELATIVAS A PESSOAS COM DEFICIÊNCIA",null,null,null,null,null,null,null,null,null,null,null,null,null,null,null,null,null,null,null,null,null,0.5,"Caso o acordo de regulação das responsabilidades parentais estabeleça uma partilha de despesas que não seja igualitária, indique ali a percentagem que foi fixada pelo Tribunal."]
[null,"DEDUÇÕES À COLETA ",null,null,null,null,null,null,null,null,null,null,null,null,null,null,"Código","Sujeito Passivo A",null,"Sujeito Passivo B",null,"Dependentes e Afilhados civis",null,"Dependentes em \nGuarda Conjunta"]
[null,"Contribuições, pagas por sujeitos passivos com deficiência, para reforma por velhice - (n.º 3 do art.º 87.º do Código do IRS)",null,null,null,null,null,null,null,null,null,null,null,null,null,null,604]
[null,"Prémios de seguros de vida, que figurem como primeiros beneficiários suj. Pas. ou dependentes deficientes  ≥ a 60% - (n.º 2 do artigo 87.º do Código do IRS)",null,null,null,null,null,null,null,null,null,null,null,null,null,null,605]
[null,"Despesas com a educação e reabilitação do sujeito passivo ou dependentes deficientes (n.º 2 do artigo 87.º do Código do IRS",null,null,null,null,null,null,null,null,null,null,null,null,null,null,606]
[null,"Encargos suportados com a reabilitação de imóveis arrendados ou localizados em áreas  de reabilitação - (n.º 4 do art.º 71.º do EBF)",null,null,null,null,null,null,null,null,null,null,null,null,null,null,607]
[null,"Donativos a igrejas e a instituições religiosas - (n.º 2 do art.º 63.º do EBF)  [Majoração 130%]",null,null,null,null,null,null,null,null,null,null,null,null,null,null,608]
[null,"Donativos concedidos no âmbito do mecenato ambiental, desportivo e educacional - (n.º 6 do art.º  62.º do EBF)  [Majoração 120%]",null,null,null,null,null,null,null,null,null,null,null,null,null,null,611]
[null,"Donativos concedidos no âmbito do mecenato ambiental, desportivo e educacional -  (n.os 6 e 7 do artigo 62.º do EBF)  [Majoração 120%]",null,null,null,null,null,null,null,null,null,null,null,null,null,null,612]
[null,"Mecenato Social - Donativos atribuídos no âmbito do mecenato social - (n.º 3 do art.º 62.º do EBF)  [Majoração 130%]",null,null,null,null,null,null,null,null,null,null,null,null,null,null,613]
[null,"Donativos no âmbito do mecenato social, para apoio à infância - (n.º 4 e alínea c) do n.º 7 do art.º 62.º do EBF)  [Majoração 140%]",null,null,null,null,null,null,null,null,null,null,null,null,null,null,614]
[null,"Mecenato Familiar – Donativos concedidos no âmbito de mecenato familiar - (n.º 5 do art.º 62.º do EBF)  [Majoração 150%]",null,null,null,null,null,null,null,null,null,null,null,null,null,null,615]
[null,"Donativos ao Estado, de natureza cultural ambiental - (n.os  1 e 2 do artigo 62.º do EBF)   [Majoração 120%]",null,null,null,null,null,null,null,null,null,null,null,null,null,null,620]
[null,"Donativos ao Estado, de natureza cultural, ambiental, - (n.ºs 1 e 2 do artigo 62.º do EBF)  [Majoração 130%]",null,null,null,null,null,null,null,null,null,null,null,null,null,null,621]
[null,"Donativos ao Estado, de natureza social - (n.ºs 1 e 2 e alínea c) do n.º 7 do art.º 62.º do EBF)  [Majoração 140%]",null,null,null,null,null,null,null,null,null,null,null,null,null,null,622]
[null,"Donativos ao Estado, de natureza familiar - (n.º 5 do artigo 62.º B do EBF)  [Majoração 150%]",null,null,null,null,null,null,null,null,null,null,null,null,null,null,623]
[]
[null,"QUADRO 6C",null,null,null,null,null,null,null,null,null,null,null,null,null,null,null,null,null,null,null,null,null,null,"Dependetes em gurada conjuta"]
[null,"DESPESAS GERAIS FAMILIARES, SAÚDE, FORMAÇÃO E EDUCAÇÃO, ENCARGOS COM IMÓVEIS, LARES, IVA, ADICIONAL AO IMI",null,null,null,null,null,null,null,null,null,null,null,null,null,null,null,null,null,null,null,null,null,0.5,"Caso o acordo de regulação das responsabilidades parentais estabeleça uma partilha de despesas que não seja igualitária, indique ali a percentagem que foi fixada pelo Tribunal."]
[null,"DEDUÇÕES À COLETA ",null,null,null,null,null,null,null,null,null,null,null,null,null,null,"Código","Sujeito Passivo A",null,"Sujeito Passivo B",null,"Dependentes e Afilhados civis",null,"Dependentes em \nGuarda Conjunta"]
[null,"Despesas gerais familiares - alínea a) do n.º 1, do art.º 78.º - B , do Código do IRS)"]
[null,"Despesas de saúde - alínea a) do n.º 1 do artigo 78.º-C do Código do IRS) \nPrémios de seguros de saúde - alínea b) do n.º 1 do artigo 78.º-C do Código do IRS)",null,null,null,null,null,null,null,null,null,null,null,null,null,null,"651\n652"]
[null,"Despesas de formação e educação - refeições escolares - (artigo 78.º-D do Código do IRS) \nDespesas de educação isentas de IVA sujeitas à taxa reduzida - (artigo 78.º-D do Código do IRS)",null,null,null,null,null,null,null,null,null,null,null,null,null,null,"658\n653"]
[null,"Despesas com rendas de estudantes deslocados até aos 25 anos - (artigo 78.º-D do Código do IRS) \n[Desde qua a distância seja superior a 50 quilómetros da residência permanente do agregado familiar]",null,null,null,null,null,null,null,null,null,null,null,null,null,null,659]
[null,"Rendas de habitação celebradas a coberto do RAU ou NRAU - alínea a ) do n.º 1 do artigo 78.º-E do Código do IRS)",null,null,null,null,null,null,null,null,null,null,null,null,null,null,654]
[null,"Juros de dívidas, contraídos com a aquisição de habitação - alíneas b ) e c ) do n.º 1 do artigo 78.º-E do Código do IRS) [Só para contratos celebrados até 31-12-2011]",null,null,null,null,null,null,null,null,null,null,null,null,null,null,655]
[null,"Encargos com lares, isentos de IVA ou sujeitos à taxa reduzida - n. os  1 e 2 do artigo 84.º do Código do IRS)",null,null,null,null,null,null,null,null,null,null,null,null,null,null,657]
[null,"Dedução á coleta do IVA pela exigência de fatura (art.º 78.º - F , n.º 1, do Código do IRS)"]
[null,"Dedução à coleta do IVA pela aquisição de passes de transportes públicos (art.º 78.º - F , n.º 3, do Código do IRS) [Nesta linha insira só o IVA dos passes]"]
[null,"Dedução à coleta do Adicional ao Imposto Municipal Sobre Imóveis (AIMI)  [alínea I) do n.º 1 do art.º 78.º do Código do IRS]"]
[]
[]
[null,"QUADRO 8",null,null,null,null,null,null,null,null,null,null,null,null,null,null,"Código","Sujeito Passivo A",null,"Sujeito Passivo B",null,"Sujeito Passivo A",null,"Sujeito Passivo B"]
[null,"ACRÉSCIMOS POR INCUMPRIMENTO DE REQUISITOS ",null,null,null,null,null,null,null,null,null,null,null,null,null,null,"☞","À coleta",null,"À coleta",null,"Ao rendimento",null,"Ao rendimento"]
[null,"Por atribuição de rendimentos ou reembolso de certificados ou planos individuais de poupança-reforma (PPR), poupança-educação (PPE)  ou poupança-reforma / educação (PPR/E) (art.º 16.º, n.º 3, e art. 21.º, n.º 4, do EBF",null,null,null,null,null,null,null,null,null,null,null,null,null,null,803]
[]
[]
[]
[]
[]
[]
[null,"INICIO"]
[]
[null,"Pensões de alimentos SP A",null,null,"Pensões de alimentos SP B"]
[null,"Indique aqui",1,null,"Indique aqui",1]
[null,"Não ",2,null,"Não ",2]
[null,"Sim ",3,null,"Sim ",3]
[null,null,{"$f":"VLOOKUP(O7,B64:C66,2,FALSE)","v":1},null,null,{"$f":"VLOOKUP(Q7,E64:F66,2,FALSE)","v":1}]
[]
[null,"Planos Poupança Reforma PPR'S  SP A",null,null,"Planos Poupança Reforma PPR'S  SP B",null,null,"Regime Público de Capitalização SP A",null,null,"Regime Público de Capitalização SP A"]
[null,"Indique a idade",0,null,"Indique a idade",0,null,"Indique a idade ",0,null,"Indique a idade ",0]
[null,"Inferior a 35 anos",1,null,"Inferior a 35 anos",1,null,"Inferior a 35 anos",1,null,"Inferior a 35 anos",1]
[null,"Entre 35 e 50 anos",2,null,"Entre 35 e 50 anos",2,null,"Superior a 35 anos",2,null,"Superior a 35 anos",2]
[null,"Superior a 50 anos",3,null,"Superior a 50 anos",3,null,null,{"$f":"VLOOKUP(O17,H70:I72,2,FALSE)","v":0},null,null,{"$f":"VLOOKUP(Q17,K70:L72,2,FALSE)","v":0}]
[null,null,{"$f":"VLOOKUP(O15,B70:C73,2,FALSE)","v":0},null,null,{"$f":"VLOOKUP(Q15,E70:F73,2,FALSE)","v":0}]
[]
[null,{"$f":"IF(Simulação!I24=0,\"➤\",IF(Simulação!I24>=1,\"Tem\",))","v":"➤"}]
[null,{"$f":"IF(O16+Q16>=1,\"Não são dedutíveis os valores aplicados pelos sujeitos passivos após a data da passagem à reforma.\",)","v":0}]
[null,{"$f":"IF(O8+Q8>=1,\"NOTA: Se optar pela dedução à coleta de 20% do valor pago em pensões de alimentos, sem limite de valor, o pai/mãe que paga esta pensão, já não poderá beneficiar das restantes deduções relacionadas com o filho em guarda conjunta.\",)","v":0}]
[null,{"$f":"IF(O8+Q8>=1,\"Uma invalida a outra.\",)","v":0}]
[]
[]
[null,"DEDUÇÕES À COLETA "]
[null,"Art.º 78.º do CIRS - Despesa adicional ao imposto municipal sobre imóveis, nos termos do artigo 135.º-I do Código do Imposto Municipal sobre Imóveis.",null,null,null,null,null,null,null,null,null,null,null,null,null,null,null,{"$f":"'Modelo 3'!D38","v":1},{"$f":"IF(S84=TRUE,4,IF(S85=TRUE,1,IF(S86=TRUE,1,'Anexo A'!S46)))","v":1}]
[null,"SP A + B Tributa. Conjunta ",null,{"$f":"IF(R49+T49<=H84+I84,R49+T49,IF(R49+T49>H84+I84,H84+I84,))","v":0},{"$f":"IF(E85>=1,0,IF(Simulação!G66>1,Simulação!G74,))","v":0},{"$f":"'Anexo B'!P11+'Anexo B'!R11+'Anexo B'!P13+'Anexo B'!P14+'Anexo B'!P16+'Anexo B'!P18+'Anexo B'!R18+'Anexo B'!P20+'Anexo B'!R20+'Anexo B'!P21+'Anexo B'!R21+'Anexo B'!P23+'Anexo B'!P24+'Anexo B'!R24+'Anexo B'!P25+'Anexo B'!R25+'Anexo B'!P26+'Anexo B'!R26+'Anexo B'!P27+'Anexo B'!R27+'Anexo B'!P43+'Anexo B'!R43+'Anexo B'!P45+'Anexo B'!R45+'Anexo B'!P46+'Anexo B'!R46+'Anexo B'!P47+'Anexo B'!R47+'Anexo B'!P48+'Anexo B'!R48+'Anexo F'!Q9+'Anexo F'!S9+'Anexo F'!Q10+'Anexo F'!S10-'Anexo F'!B70","v":0},{"$f":"Simulação!G80","v":0},{"$f":"IF(E84=0,0,(F84*G84)/E84)","v":0},{"$f":"IF(E84=0,0,'Anexo F'!B60)","v":0},null,null,null,null,null,null,null,null,null,{"$f":"'Modelo 3'!D43","v":0}]
[null,"SP A Tributação Separada ",null,{"$f":"IF(R49+T49<=H85+I85,R49+T49,IF(R49+T49>H85+I85,H85+I85,))","v":0},{"$f":"IF(Simulação!H66>1,Simulação!H74,)","v":0},{"$f":"'Anexo B'!P11+'Anexo B'!P13+'Anexo B'!P14+'Anexo B'!P16+'Anexo B'!P18+'Anexo B'!P20+'Anexo B'!P21+'Anexo B'!P22+'Anexo B'!P23+'Anexo B'!P24+'Anexo B'!P25+'Anexo B'!P26+'Anexo B'!P27+'Anexo B'!P43+'Anexo B'!P45+'Anexo B'!P46+'Anexo B'!P47+'Anexo B'!P48+'Anexo F'!Q9+'Anexo F'!Q10-'Anexo F'!I68","v":0},{"$f":"Simulação!H80","v":0},{"$f":"IF(E85=0,0,(F85*G85)/E85)","v":0},{"$f":"IF(E85=0,0,'Anexo F'!L58)","v":0},null,null,null,null,null,null,null,null,null,{"$f":"'Modelo 3'!E43","v":0}]
[null,"SP B Tributação Separada",null,{"$f":"IF(R49+T49<=H86+I86,R49+T49,IF(R49+T49>H86+I86,H86+I86,))","v":0},{"$f":"IF(Simulação!I66>1,Simulação!I74,)","v":0},{"$f":"'Anexo B'!R11+'Anexo B'!R13+'Anexo B'!R14+'Anexo B'!R16+'Anexo B'!R18+'Anexo B'!R20+'Anexo B'!R21+'Anexo B'!R22+'Anexo B'!R23+'Anexo B'!R24+'Anexo B'!R25+'Anexo B'!R26+'Anexo B'!R27+'Anexo B'!R43+'Anexo B'!R45+'Anexo B'!R46+'Anexo B'!R47+'Anexo B'!R48+'Anexo F'!S9+'Anexo F'!S10-'Anexo F'!I69","v":0},{"$f":"Simulação!I80","v":0},{"$f":"IF(E86=0,0,(F86*G86)/E86)","v":0},{"$f":"IF(E86=0,0,'Anexo F'!L59)","v":0},null,null,null,null,null,null,null,null,null,{"$f":"'Modelo 3'!F43","v":0}]
[null,"Continente ",null,"SOMA",{"$f":"SUM(D84:D86)","v":0},{"$f":"IF(S83=1,E87,)","v":0},null,null,"T. Separado"]
[null,"Açores ",null,"SOMA",{"$f":"IF(E87<0,0,E87)","v":0},{"$f":"IF(S83=2,E88,)","v":0},null,"SP A→",{"$f":"SUM(K88)","v":0},null,{"$f":"IF(R83=0,0,IF(S83>=4,0,SUM(D85,)))","v":0}]
[null,"Madeira",null,"SOMA",{"$f":"IF(E87<0,0,E87)","v":0},{"$f":"IF(S83=3,E89,)","v":0},null,"SP B→",{"$f":"SUM(K89)","v":0},null,{"$f":"IF(R83=0,0,IF(S83>=4,0,SUM(D86,)))","v":0}]
[null,{"$f":"IF(E87<0,0,SUM(F87+F88+F89))","v":0},null,"← Dedução à coleta (Azul)"]
[]
[null,"Art.º 78.º - A do CIRS - Deduções Pessoalizantes",null,null,null,null,null,null,null,null,null,null,null,null,null,null,null,{"$f":"'Modelo 3'!D38","v":1},{"$f":"IF(V92=TRUE,4,IF(V93=TRUE,1,IF(V94=TRUE,1,'Anexo A'!S46)))","v":1},null,null,{"$f":"'Modelo 3'!D43","v":0}]
[null,"Limites →",null,600,126,null,null,null,null,null,null,300,63,null,null,null,null,null,null,525,110,{"$f":"'Modelo 3'!E43","v":0}]
[null,null,null,"Dependentes + 3 anos",null,"Dependente\n ≤ 3 anos",null,"Afilhados Civis + 3 anos",null,"Afilhados Civis ≤ 3 anos",null,"Depend. G. Conjunta +3 anos",null,"Depend. G. Conjunta ≤3 Anos",null,"A. Civis G. Conjunta+ 3 anos",null,"A. Civis G. Conjunta ≤ 3 anos",null,"Ascendentes",null,{"$f":"'Modelo 3'!F43","v":0}]
[null,"SOMA TOTAL →",null,{"$f":"D93*E95","v":0},{"$f":"'Modelo 3'!G16","v":0},{"$f":"(D93*G95)+E93*G95","v":0},{"$f":"'Modelo 3'!H16","v":0},{"$f":"D93*I95","v":0},{"$f":"'Modelo 3'!I16","v":0},{"$f":"(D93*K95)+E93*K95","v":0},{"$f":"'Modelo 3'!J16","v":0},{"$f":"IF(O8+Q8>=1,0,(L93*M95))","v":0},{"$f":"'Modelo 3'!G17","v":0},{"$f":"IF(O95=0,0,IF(O8+Q8>=1,0,((L93*O95)+M93)))","v":0},{"$f":"'Modelo 3'!H17","v":0},{"$f":"IF(O8+Q8>=1,0,(L93*Q95))","v":0},{"$f":"'Modelo 3'!I17","v":0},{"$f":"IF(S95=0,0,IF(O8+Q8>=1,0,((L93*S95)+M93)))","v":0},{"$f":"'Modelo 3'!J17","v":0},{"$f":"IF(U95=1,T93+U93,IF(U95=2,T93,0))","v":0},{"$f":"'Modelo 3'!K16","v":0}]
[null,"Continente ",null,"SOMA",{"$f":"SUM(D95+F95+H95+J95+L95+N95+P95+R95+T95)","v":0},{"$f":"IF(S92=1,E96,)","v":0},null,null,"T. Separado"]
[null,"Açores ",null,"SOMA",{"$f":"IF(E96<0,0,E96)","v":0},{"$f":"IF(S92=2,E97,)","v":0},null,"SP A→",{"$f":"IF(S92>=4,0,SUM(K97))","v":0},null,{"$f":"IF(R92=0,0,E96/2)","v":0}]
[null,"Madeira",null,"SOMA",{"$f":"IF(E97<0,0,E97)","v":0},{"$f":"IF(S92=3,E98,)","v":0},null,"SP B→",{"$f":"IF(S92>=4,0,SUM(K98))","v":0},null,{"$f":"IF(R92=0,0,E96/2)","v":0}]
[null,{"$f":"IF(E96<0,0,SUM(F96+F97+F98))","v":0},null,"← Dedução à coleta (Azul)"]
[]
[null,"Art.º 78.º - B do CIRS - Dedução das despesas gerais familiares ",null,null,null,null,null,null,null,null,null,null,null,null,null,null,null,{"$f":"'Modelo 3'!D38","v":1},{"$f":"IF(S102=TRUE,4,IF(S103=TRUE,1,IF(S104=TRUE,1,'Anexo A'!S46)))","v":1}]
[null,"T.  Separada →",null,{"$f":"D107","v":0},null,{"$f":"F107","v":0},null,{"$f":"H107","v":0},null,{"$f":"J107","v":0},null,{"$f":"L107","v":0},null,null,null,"F. Monoparental →",null,{"$f":"'Modelo 3'!G38","v":0},{"$f":"'Modelo 3'!D43","v":0}]
[null,"Taxas →",null,{"$f":"IF(R102=1,0,35%)","v":0.35},null,null,null,{"$f":"IF(R102>=1,0,17.5%)","v":0.17499999999999999},null,{"$f":"IF(R102>=1,45%,)","v":0},null,null,null,null,null,null,null,null,{"$f":"'Modelo 3'!E43","v":0}]
[null,"Limites →",null,500,null,null,null,{"$f":"D104/2","v":250},null,335,null,null,null,null,null,null,null,null,{"$f":"'Modelo 3'!F43","v":0}]
[null,"Despesas →",null,{"$f":"R40","v":0},null,{"$f":"T40","v":0},null,{"$f":"V40","v":0},null,{"$f":"SUM(R40+T40+V40+X40,0)","v":0},null,{"$f":"X40","v":0},null,{"$f":"SUM(D102+F102)","v":0}]
[null,null,null,"Sujeito Passivo A ",null,"Sujeito Passivo B",null,"Dependentes",null,"F. Monoparental",null,"Guarda Conjunta",null,{"$f":"IF(N105<D104,D102+F102,D104)","v":0},{"$f":"D104/2","v":250}]
[null,"SOMA TOTAL →",null,{"$f":"IF(D105*D103<D104,D105*D103,D104)+H107+L107","v":0},null,{"$f":"IF(F105*D103<D104,F105*D103,D104)+H107+L107","v":0},null,{"$f":"IF(H105*H103<H104,H105*H103,H104)","v":0},null,{"$f":"IF(J105*J103<J104,J105*J103,J104)","v":0},null,{"$f":"IF(L105*D103<D104,L105*D103,D104)*X38","v":0}]
[null,"Continente ",null,"SOMA",{"$f":"N106+J102","v":0},{"$f":"IF(S101=1,E108,)","v":0},null,null,"T. Separado"]
[null,"Açores ",null,"SOMA",{"$f":"IF(E108<0,0,E108)","v":0},{"$f":"IF(S101=2,E109,)","v":0},null,"SP A→",{"$f":"IF(S101>=4,0,SUM(K109))","v":0},null,{"$f":"IF(R101=0,0,SUM(L109))","v":0},{"$f":"IF(D102>=O106,O106,D102)","v":0}]
[null,"Madeira",null,"SOMA",{"$f":"IF(E108<0,0,E108)","v":0},{"$f":"IF(S101=3,E110,)","v":0},null,"SP B→",{"$f":"IF(S101>=4,0,SUM(K110))","v":0},null,{"$f":"IF(R101=0,0,SUM(L110))","v":0},{"$f":"IF(F102>=O106,O106,F102)","v":0}]
[null,{"$f":"IF(E108<0,0,SUM(F108+F109+F110))","v":0},null,"← Dedução à coleta (Azul)"]
[]
[null," Art.º 78.º - C do CIRS -  Despesas de saúde + seguros vida",null,null,null,null,null,null,null,null,null,null,null,null,null,null,null,{"$f":"'Modelo 3'!D38","v":1},{"$f":"IF(S114=TRUE,4,IF(S115=TRUE,1,IF(S116=TRUE,1,'Anexo A'!S46)))","v":1}]
[null,"T.  Separada →",null,{"$f":"D119","v":0},null,{"$f":"F119","v":0},null,{"$f":"H119","v":0},null,{"$f":"J119","v":0},null,null,null,null,null,null,null,null,{"$f":"'Modelo 3'!D43","v":0}]
[null,"Taxas →",null,0.15,null,null,null,7.4999999999999997E-2,null,null,null,null,null,null,null,null,null,null,{"$f":"'Modelo 3'!E43","v":0}]
[null,"Limites →",null,1000,null,null,null,{"$f":"D116/2","v":500},null,null,null,null,null,null,null,null,null,null,{"$f":"'Modelo 3'!F43","v":0}]
[null,"Despesas →",null,{"$f":"R41","v":0},null,{"$f":"T41","v":0},null,{"$f":"V41","v":0},null,{"$f":"IF(O8+Q8>=1,0,X41)","v":0},null,{"$f":"SUM(D114+F114)","v":0}]
[null,null,null,"Sujeito Passivo A ",null,"Sujeito Passivo B",null,"Dependentes",null,"Guarda Conjunta",null,{"$f":"IF(L117<D116,D114+F114,D116)","v":0},{"$f":"D116/2","v":500}]
[null,"SOMA TOTAL →",null,{"$f":"IF(D117*D115<D116,D117*D115,D116)+H119+J119","v":0},null,{"$f":"IF(F117*D115<D116,F117*D115,D116)+H119+J119","v":0},null,{"$f":"IF(H117*H115<H116,H117*H115,H116)","v":0},null,{"$f":"IF(J117*D115<D116,J117*D115,D116)*X38","v":0}]
[null,"Continente ",null,"SOMA",{"$f":"SUM(L118)","v":0},{"$f":"IF(S113=1,E120,)","v":0},null,null,"T. Separado"]
[null,"Açores ",null,"SOMA",{"$f":"IF(E120<0,0,E120)","v":0},{"$f":"IF(S113=2,E121,)","v":0},null,"SP A→",{"$f":"IF(S113>=4,0,SUM(K121,))","v":0},null,{"$f":"IF(R113=0,0,SUM(L121))","v":0},{"$f":"IF(D114>=M118,M118,D114)","v":0}]
[null,"Madeira",null,"SOMA",{"$f":"IF(E120<0,0,E120)","v":0},{"$f":"IF(S113=3,E122,)","v":0},null,"SP B→",{"$f":"IF(S113>=4,0,SUM(K122,))","v":0},null,{"$f":"IF(R113=0,0,SUM(L122))","v":0},{"$f":"IF(F114>=M118,M118,F114)","v":0}]
[null,{"$f":"IF(E120<0,0,SUM(F120+F121+F122))","v":0},null,"← Dedução à Coleta (Vermelho)"]
[]
[null,"Art.º 78.º - D do CIRS - Despesas de formação e educação ",null,null,null,null,null,null,null,null,null,null,null,null,null,null,null,{"$f":"'Modelo 3'!D38","v":1},{"$f":"IF(S126=TRUE,4,IF(S127=TRUE,1,IF(S128=TRUE,1,'Anexo A'!S46)))","v":1}]
[null,"T.  Separada →",null,{"$f":"D133","v":0},null,{"$f":"F133","v":0},null,{"$f":"H133+H134","v":0},null,{"$f":"J133+J134","v":0},null,null,null,null,null,null,null,null,{"$f":"'Modelo 3'!D43","v":0}]
[null,null,null,{"$f":"D134","v":0},null,{"$f":"F134","v":0},null,{"$f":"H134/2","v":0},null,{"$f":"J134*X38","v":0},null,null,null,null,null,null,null,null,{"$f":"'Modelo 3'!E43","v":0}]
[null,"Taxas →",null,0.3,null,null,null,0.15,null,null,null,null,null,null,null,null,null,null,{"$f":"'Modelo 3'!F43","v":0}]
[null,"Limites →",null,800,{"$f":"IF(L131>=D129,200,IF(L131<D129,300,))","v":300},null,null,{"$f":"IF(R125=0,D129,IF(R125=1,D129/2))","v":400}]
[null,"Despesas Educação →",null,{"$f":"R42","v":0},null,{"$f":"T42","v":0},null,{"$f":"V42","v":0},null,{"$f":"IF(O8+Q8>=1,0,X42)","v":0}]
[null,"Rendas Estud. Deslo. →",null,{"$f":"R43","v":0},null,{"$f":"T43","v":0},null,{"$f":"V43","v":0},null,{"$f":"X43","v":0},null,{"$f":"SUM(D126+F126)","v":0},{"$f":"SUM(D127+F127)","v":0}]
[null,null,null,"Sujeito Passivo A ",null,"Sujeito Passivo B",null,"Dependentes",null,"Guarda Conjunta",null,{"$f":"IF(L131<D129,D126+F126,D129)","v":0},{"$f":"IF(M131<E129,D127+F127,E129)","v":0},{"$f":"D129/2","v":400},{"$f":"E129/2","v":150}]
[null,"SOMA TOTAL →",null,{"$f":"IF(D130*D128<D129,D130*D128,D129)+H133+J133","v":0},null,{"$f":"IF(F130*D128<D129,F130*D128,D129)+H133+J133","v":0},null,{"$f":"IF(H130*H128<H129,H130*H128,H129)","v":0},null,{"$f":"IF(J130*D128<D129,J130*D128,D129)*X38","v":0}]
[null,null,null,{"$f":"IF(D131*D128<E129,D131*D128,E129)+H134+J134","v":0},null,{"$f":"IF(F131*D128<E129,F131*D128,E129)+H134+J134","v":0},null,{"$f":"IF(H131*D128<E129,H131*D128,E129)/2","v":0},null,{"$f":"IF(J131*D128<E129,J131*D128,E129)/2","v":0}]
[null,"Continente ",null,"SOMA",{"$f":"SUM(L132)+M132","v":0},{"$f":"IF(S125=1,E135,)","v":0},null,null,"T. Separado"]
[null,"Açores ",null,"SOMA",{"$f":"IF(E135<0,0,E135)","v":0},{"$f":"IF(S125=2,E136,)","v":0},null,"SP A→",{"$f":"IF(S125>=4,0,SUM(K136))","v":0},null,{"$f":"IF(R125=0,0,SUM(L136+M136))","v":0},{"$f":"IF(D126>=N132,N132,D126)","v":0},{"$f":"IF(D127>=O132,O132,D127)","v":0}]
[null,"Madeira",null,"SOMA",{"$f":"IF(E135<0,0,E135)","v":0},{"$f":"IF(S125=3,E137,)","v":0},null,"SP B→",{"$f":"IF(S125>=4,0,SUM(K137))","v":0},null,{"$f":"IF(R125=0,0,SUM(L137+M137))","v":0},{"$f":"IF(F126>=N132,N132,F126)","v":0},{"$f":"IF(F127>=O132,O132,F127)","v":0}]
[null,{"$f":"IF(E135<0,0,SUM(F135+F136+F137))","v":0},null,"← Dedução à Coleta (Vermelho)"]
[]
[null,"Art.º 78.º - E do CIRS - Rendas de imóveis para habitação permanente",null,null,null,null,null,null,null,null,null,null,null,null,null,null,{"$f":"Q153","v":2},{"$f":"'Modelo 3'!D38","v":1},{"$f":"IF(S141=TRUE,4,IF(S142=TRUE,1,IF(S143=TRUE,1,'Anexo A'!S46)))","v":1}]
[null,"T.  Separada →",null,{"$f":"D147","v":0},null,{"$f":"F147","v":0},null,{"$f":"H147","v":0},null,null,null,null,null,null,null,null,null,null,{"$f":"'Modelo 3'!D43","v":0}]
[null,"Taxas →",null,0.15,null,null,null,7.4999999999999997E-2,null,null,null,null,null,null,null,null,null,null,{"$f":"'Modelo 3'!E43","v":0}]
[null,"Limites →",null,502,800,30000,7091,{"$f":"F143-G143","v":22909},{"$f":"IF(Q140=1,IF(D144<=G143,E143,IF(D144>=F143,D143,D143+(E143-D143)*(F143-D144)/H143)),IF(Q140=2,IF(D144>F143,D143/2,IF(D144<=G143,E143/2,(D143+(E143-D143)*(F143-D144)/(F143-G143))/2))))","v":400},{"$f":"IF(D141<I143,D141,I143)","v":0},"← SP A",null,null,null,null,null,null,null,{"$f":"'Modelo 3'!F43","v":0}]
[null,"Rto.Coletável →",null,{"$f":"Simulação!H74","v":0},null,{"$f":"Simulação!I74","v":0},null,null,{"$f":"IF(Q140=1,IF(F144<=G143,E143,IF(F144>=F143,D143,D143+(E143-D143)*(F143-F144)/H143)),IF(Q140=2,IF(F144>F143,D143/2,IF(F144<=G143,E143/2,(D143+(E143-D143)*(F143-F144)/(F143-G143))/2))))","v":400},{"$f":"IF(F141<I144,F141,I144)","v":0},"← SP B"]
[null,"Despesas →",null,{"$f":"R44+H145","v":0},null,{"$f":"T44+H145","v":0},null,{"$f":"V44/2","v":0}]
[null,null,null,"Sujeito Passivo A ",null,"Sujeito Passivo B",null,"Dependentes",null,{"$f":"IF(Q140>=1,IF(L146<=7091,MIN(0.15*(D145+F145),800),IF(L146<=30000,MIN(0.15*(D145+F145),502+(800-502)*(30000-L146)/(30000-7091)),MIN(0.15*(D145+F145),502))),IF((L146)/1<=7091,MIN(0.15*(D145+D145),800),IF((L146)/1<=30000,MIN(0.15*(D145+F145),502+(800-502)*(30000-(L146)/1)/(30000-7091)),MIN(0.15*(D145+F145),502))))","v":0},{"$f":"IF(Q140>=1,IF(L146>F143,D143,IF(L146<=G143,E143,(D143+(E143-D143)*(F143-L146)/(F143-G143)))))","v":800},{"$f":"Simulação!G74","v":0}]
[null,"SOMA TOTAL →",null,{"$f":"IF(D145*D142<D143,D145*D142,D143)","v":0},null,{"$f":"IF(F145*D142<D143,F145*D142,D143)","v":0},null,{"$f":"H145*H142","v":0},null,"Ver aqui↑","Quando houver alterações"]
[null,"Continente ",null,"SOMA",{"$f":"SUM(J146)","v":0},{"$f":"IF(S140=1,E148,)","v":0},null,null,"T. Separado"]
[null,"Açores ",null,"SOMA",{"$f":"IF(E148<0,0,E148)","v":0},{"$f":"IF(S140=2,E149,)","v":0},null,"SP A→",{"$f":"IF(S140>=4,0,SUM(K149))","v":0},null,{"$f":"IF(R140=0,0,SUM(L149))","v":0},{"$f":"IF(B164>=1,0,IF(J146>=1,J143,))","v":0}]
[null,"Madeira",null,"SOMA",{"$f":"IF(E148<0,0,E148)","v":0},{"$f":"IF(S140=3,E150,)","v":0},null,"SP B→",{"$f":"IF(S140>=4,0,SUM(K150))","v":0},null,{"$f":"IF(R140=0,0,SUM(L150))","v":0},{"$f":"IF(B164>=1,0,IF(J146>=1,J144,))","v":0}]
[null,{"$f":"IF(B164>1,0,IF(E148<0,0,SUM(F148+F149+F150)))","v":0},null,"← Dedução à Coleta (Vermelho)"]
[]
[null,"Art.º 78.º - E do CIRS - Juros de dívidas, contraídas com a aquisição de habitação",null,null,null,null,null,null,null,null,null,null,null,null,null,null,{"$f":"'Modelo 3'!C59","v":2},{"$f":"'Modelo 3'!D38","v":1},{"$f":"IF(S154=TRUE,4,IF(S155=TRUE,1,IF(S156=TRUE,1,'Anexo A'!S46)))","v":1}]
[null,"T.  Separada →",null,{"$f":"D160","v":0},null,{"$f":"F160","v":0},null,{"$f":"H160","v":0},null,null,null,null,null,null,null,null,null,null,{"$f":"'Modelo 3'!D43","v":0}]
[null,"Taxas →",null,0.15,null,null,null,7.4999999999999997E-2,null,null,null,null,null,null,null,null,null,null,{"$f":"'Modelo 3'!E43","v":0}]
[null,"Limites →",null,296,450,30000,7091,{"$f":"F156-G156","v":22909},{"$f":"IF(Q153=1,IF(D157<=G156,E156,IF(D157>=F156,D156,D156+(E156-D156)*(F156-D157)/H156)),IF(Q153=2,IF(D157>F156,D156/2,IF(D157<=G156,E156/2,(D156+(E156-D156)*(F156-D157)/(F156-G156))/2))))","v":225},{"$f":"IF(D154<I156,D154,I156)","v":0},"← SP A",null,null,null,null,null,null,null,{"$f":"'Modelo 3'!F43","v":0}]
[null,"Rto.Coletável →",null,{"$f":"Simulação!H74","v":0},null,{"$f":"Simulação!I74","v":0},null,null,{"$f":"IF(Q153=1,IF(F157<=G156,E156,IF(F157>=F156,D156,D156+(E156-D156)*(F156-F157)/H156)),IF(Q153=2,IF(F157>F156,D156/2,IF(F157<=G156,E156/2,(D156+(E156-D156)*(F156-F157)/(F156-G156))/2))))","v":225},{"$f":"IF(F154<I157,F154,I157)","v":0},"← SP B"]
[null,"Despesas →",null,{"$f":"R45+H158","v":0},null,{"$f":"T45+H158","v":0},null,{"$f":"V45/2","v":0}]
[null,null,null,"Sujeito Passivo A ",null,"Sujeito Passivo B",null,"Dependentes",null,{"$f":"IF(Q153>=1,IF(L159<=7091,MIN(0.15*(D158+F158),450),IF(L159<=30000,MIN(0.15*(D158+F158),296+(450-296)*(30000-L159)/(30000-7091)),MIN(0.15*(D158+F158),296))),IF((L159)/1<=7091,MIN(0.15*(D158+F158),450),IF((L159)/1<=30000,MIN(0.15*(D158+F158),296+(450-296)*(30000-(L159)/1)/(30000-7091)),MIN(0.15*(D158+F158),296))))","v":0},{"$f":"IF(Q153>=1,IF(L159>F156,D156,IF(L159<=G156,E156,(D156+(E156-D156)*(F156-L159)/(F156-G156)))))","v":450},{"$f":"Simulação!G74","v":0}]
[null,"SOMA TOTAL →",null,{"$f":"IF(D158*D155<D156,D158*D155,D156)","v":0},null,{"$f":"IF(F158*D155<D156,F158*D155,D156)","v":0},null,{"$f":"H158*H155","v":0},null,"Ver aqui↑","Quando houver alterações"]
[null,"Continente ",null,"SOMA",{"$f":"SUM(J159)","v":0},{"$f":"IF(S153=1,E161,)","v":0},null,null,"T. Separado"]
[null,"Açores ",null,"SOMA",{"$f":"IF(E161<0,0,E161)","v":0},{"$f":"IF(S153=2,E162,)","v":0},null,"SP A→",{"$f":"IF(S153>=4,0,SUM(K162))","v":0},null,{"$f":"IF(R153=0,0,SUM(L162))","v":0},{"$f":"IF(J159>=1,J156,)","v":0}]
[null,"Madeira",null,"SOMA",{"$f":"IF(E161<0,0,E161)","v":0},{"$f":"IF(S153=3,E163,)","v":0},null,"SP B→",{"$f":"IF(S153>=4,0,SUM(K163))","v":0},null,{"$f":"IF(R153=0,0,SUM(L163))","v":0},{"$f":"IF(J159>=1,J157,)","v":0}]
[null,{"$f":"IF(E161<0,0,SUM(F161+F162+F163))","v":0},null,"← Dedução à Coleta (Vermelho)"]
[]
[null,"Art.º 78.º - F do CIRS -  Dedução pela exigência de fatura IVA",null,null,null,null,null,null,null,null,null,null,null,null,null,null,null,{"$f":"'Modelo 3'!D38","v":1},{"$f":"IF(S167=TRUE,4,IF(S168=TRUE,1,IF(S169=TRUE,1,'Anexo A'!S46)))","v":1}]
[null,"T.  Separada →",null,{"$f":"D172+D173","v":0},null,{"$f":"F172+F173","v":0},null,{"$f":"H172","v":0},null,{"$f":"(J172)","v":0},null,null,null,null,null,null,null,null,{"$f":"'Modelo 3'!D43","v":0}]
[null,"Taxas →",null,0.15,null,null,null,7.4999999999999997E-2,null,null,null,null,null,null,null,null,null,null,{"$f":"'Modelo 3'!E43","v":0}]
[null,"Limites →",null,250,null,null,null,125,null,null,null,null,null,null,null,null,null,null,{"$f":"'Modelo 3'!F43","v":0}]
[null,"Despesas →",null,{"$f":"R47","v":0},null,{"$f":"T47","v":0},null,{"$f":"V47","v":0},null,{"$f":"X47","v":0},null,{"$f":"SUM(D167+F167)","v":0}]
[null,null,null,"Sujeito Passivo A ",null,"Sujeito Passivo B",null,"Dependentes",null,"Guarda Conjunta",null,{"$f":"IF(L170<D169,D167+F167,D169)","v":0},{"$f":"D169/2","v":125}]
[null,"SOMA TOTAL →",null,{"$f":"IF(D170*D168<D169,D170*D168,D169)+H172+J172","v":0},null,{"$f":"IF(F170*D168<D169,F170*D168,D169)+H172+J172","v":0},null,{"$f":"IF(H170*H168<H169,H170*H168,H169)","v":0},null,{"$f":"IF(J170*D168<D169,J170*D168,D169)*X38","v":0}]
[null,null,null,{"$f":"R48+H173+J173","v":0},null,{"$f":"T48+H173+J173","v":0},null,{"$f":"V48*0.5","v":0},null,{"$f":"X48*X38","v":0}]
[null,"Continente ",null,"SOMA",{"$f":"SUM(L171)","v":0},{"$f":"IF(S166=1,E174,)","v":0},null,null,"T. Separado"]
[null,"Açores ",null,"SOMA",{"$f":"IF(E174<0,0,E174)","v":0},{"$f":"IF(S166=2,E175,)","v":0},null,"SP A→",{"$f":"IF(S166>=4,0,SUM(K175))","v":0},null,{"$f":"IF(R166=0,0,SUM(L175))","v":0},{"$f":"IF(D167>=M171,M171,D167)","v":0}]
[null,"Madeira",null,"SOMA",{"$f":"IF(E174<0,0,E174)","v":0},{"$f":"IF(S166=3,E176,)","v":0},null,"SP B→",{"$f":"IF(S166>=4,0,SUM(K176))","v":0},null,{"$f":"IF(R166=0,0,SUM(L176))","v":0},{"$f":"IF(F167>=M171,M171,F167)","v":0}]
[null,{"$f":"IF(E174<0,0,SUM(F174+F175+F176))","v":0},null,"← Dedução à Coleta (Vermelho)"]
[]
[null,"Art.º 83.º - A do CIRS -  Pensões de alimentos pagas  por decisão Judicial",null,null,null,null,null,null,null,null,null,null,null,null,null,null,null,{"$f":"'Modelo 3'!D38","v":1},{"$f":"IF(S180=TRUE,4,IF(S181=TRUE,1,IF(S182=TRUE,1,'Anexo A'!S46)))","v":1}]
[null,"T.  Separada →",null,{"$f":"D184","v":0},null,{"$f":"F184","v":0},null,null,null,null,null,null,null,null,null,null,null,null,{"$f":"'Modelo 3'!D43","v":0}]
[null,"Taxas →",null,0.2,null,null,null,null,null,null,null,null,null,null,null,null,null,null,{"$f":"'Modelo 3'!E43","v":0}]
[null,"Valor da pensão →",null,{"$f":"O8","v":0},null,{"$f":"Q8","v":0},null,null,null,null,null,null,null,null,null,null,null,null,{"$f":"'Modelo 3'!F43","v":0}]
[null,null,null,"Sujeito Passivo A ",null,"Sujeito Passivo B"]
[null,"SOMA TOTAL →",null,{"$f":"D182*D181","v":0},null,{"$f":"F182*D181","v":0}]
[null,"Continente ",null,"SOMA",{"$f":"SUM(D184:F184)","v":0},{"$f":"IF(S179=1,E185,)","v":0},null,null,"T. Separado"]
[null,"Açores ",null,"SOMA",{"$f":"IF(E185<0,0,E185)","v":0},{"$f":"IF(S179=2,E186,)","v":0},null,"SP A→",{"$f":"SUM(K186)","v":0},null,{"$f":"IF(R179=0,0,D184)","v":0}]
[null,"Madeira",null,"SOMA",{"$f":"IF(E185<0,0,E185)","v":0},{"$f":"IF(S179=3,E187,)","v":0},null,"SP B→",{"$f":"SUM(K187)","v":0},null,{"$f":"IF(R179=0,0,F184)","v":0}]
[null,{"$f":"IF(E185<0,0,SUM(F185+F186+F187))","v":0},null,"← Dedução à Coleta (Vermelho)"]
[]
[null,"Art.º 84.º do CIRS - Encargos com lares",null,null,null,null,null,null,null,null,null,null,null,null,null,null,null,{"$f":"'Modelo 3'!D38","v":1},{"$f":"IF(S191=TRUE,4,IF(S192=TRUE,1,IF(S193=TRUE,1,'Anexo A'!S46)))","v":1}]
[null,"T.  Separada →",null,{"$f":"D196","v":0},null,{"$f":"F196","v":0},null,{"$f":"H196","v":0},null,{"$f":"J196","v":0},null,null,null,null,null,null,null,null,{"$f":"'Modelo 3'!D43","v":0}]
[null,"Taxas →",null,0.25,null,null,null,0.125,null,null,null,null,null,null,null,null,null,null,{"$f":"'Modelo 3'!E43","v":0}]
[null,"Limites →",null,403.75,null,null,null,{"$f":"D193/2","v":201.875},null,null,null,null,null,null,null,null,null,null,{"$f":"'Modelo 3'!F43","v":0}]
[null,"Despesas →",null,{"$f":"R46","v":0},null,{"$f":"T46","v":0},null,{"$f":"V46","v":0},null,{"$f":"IF(O8+Q8>=1,0,X46)","v":0},null,{"$f":"SUM(D191+F191)","v":0}]
[null,null,null,"Sujeito Passivo A ",null,"Sujeito Passivo B",null,"Dependentes",null,"Guarda Conjunta",null,{"$f":"IF(L194<D193,D191+F191,D193)","v":0},{"$f":"D193/2","v":201.875}]
[null,"SOMA TOTAL →",null,{"$f":"IF(D194*D192<D193,D194*D192,D193)+H196+J196","v":0},null,{"$f":"IF(F194*D192<D193,F194*D192,D193)+H196+J196","v":0},null,{"$f":"IF(H194*H192<H193,H194*H192,H193)","v":0},null,{"$f":"IF(J194*D192<D193,J194*D192,D193)*X38","v":0}]
[null,"Continente ",null,"SOMA",{"$f":"SUM(L195)","v":0},{"$f":"IF(S190=1,E197,)","v":0},null,null,"T. Separado"]
[null,"Açores ",null,"SOMA",{"$f":"IF(E197<0,0,E197)","v":0},{"$f":"IF(S190=2,E198,)","v":0},null,"SP A→",{"$f":"IF(S190>=4,0,SUM(K198))","v":0},null,{"$f":"IF(R190=0,0,SUM(L198))","v":0},{"$f":"IF(D191>=M195,M195,D191)","v":0}]
[null,"Madeira",null,"SOMA",{"$f":"IF(E197<0,0,E197)","v":0},{"$f":"IF(S190=3,E199,)","v":0},null,"SP B→",{"$f":"IF(S190>=4,0,SUM(K199))","v":0},null,{"$f":"IF(R190=0,0,SUM(L199))","v":0},{"$f":"IF(F191>=M195,M195,F191)","v":0}]
[null,{"$f":"IF(E197<0,0,SUM(F197+F198+F199))","v":0},null,"← Dedução à Coleta (Vermelho)"]
[]
[null,"Art.º 87.º do CIRS - Sujeitos Passivos, dependentes e Ascendentes com deficiência ",null,null,null,null,null,null,null,null,null,null,null,null,null,null,null,{"$f":"'Modelo 3'!D38","v":1},{"$f":"IF(S203=TRUE,4,IF(S204=TRUE,1,IF(S205=TRUE,1,'Anexo A'!S46)))","v":1}]
[null,"T.  Separada →",null,{"$f":"D213","v":0},null,null,{"$f":"G213","v":0},null,null,{"$f":"J213/2","v":0},null,null,{"$f":"M213/2","v":0},null,null,{"$f":"IF(R202=0,0,P213/2)","v":0},null,null,{"$f":"'Modelo 3'!D43","v":0},"SP A+B Conjunta"]
[null,null,null,"Deficiente ≥ 60%",null,{"$f":"1900","v":1900},"Deficiente ≥ 60%",null,{"$f":"1900","v":1900},"Deficiente ≥ 60%",null,{"$f":"1187.5","v":1187.5},"Deficiente ≥ 60%",null,{"$f":"1187.5/2","v":593.75},null,null,null,{"$f":"'Modelo 3'!E43","v":0},{"$f":"E209+H209","v":0},"≥ 60%","◄Art.º 87.º  do CIRS, Dedução dos sujeitos passivos, deficientes, com grau de invalidez ≥ 60% e < 90 %;"]
[null,null,null,"Deficiente ≥ 90%",null,{"$f":"1900","v":1900},"Deficiente ≥ 90%",null,1900,"Deficiente ≥ 90%",null,{"$f":"1900","v":1900},"Deficiente ≥ 90%",null,{"$f":"1900/2","v":950},null,null,null,{"$f":"'Modelo 3'!F43","v":0},{"$f":"K209+N209+P213","v":0},"≥ 60%","◄Art.º 87.º  do CIRS, Dedução dos dependentes, afilhados civis, ascendentes, deficientes, com grau de invalidez ≥ 60% e < 90 %;"]
[null,null,null,"Deficiente FA  ≥ 60%",null,{"$f":"2375","v":2375},"Deficiente FA  ≥ 60%",null,{"$f":"2375","v":2375},"Deficiente FA  ≥ 60%",null,{"$f":"1187.5","v":1187.5},"Deficiente FA  ≥ 60%",null,{"$f":"1187.5/2","v":593.75},null,null,null,null,{"$f":"E210+H210+K210+N210","v":0}," ≥ 90%","◄Art.º 87.º  do CIRS, Deduão dos sujeito passivos, dependentes, afilhados civis, deficientes, com grau de invalidez ≥ 90%;"]
[null,null,null,"Deficiente FA  ≥ 90%",null,1900,"Deficiente FA  ≥ 90%",null,1900,"Deficiente FA  ≥ 90%",null,{"$f":"1900","v":1900},"Deficiente FA  ≥ 90%",null,{"$f":"1900/2","v":950},null,{"$f":"1187.5","v":1187.5},null,null,{"$f":"E211+H211+K211+N211","v":0}," FA  ≥ 60%","◄Art.º 87.º  do CIRS, Dedução dos sujeitos passivos, dependentes, afilhados civis, deficientes  das Forças Armadas, com grau de invalidez ≥ 60% e < 90 %;"]
[null,null,null,"Sujeito Passivo A ",null,null,"Sujeito Passivo B",null,null,"Dependentes",null,null,"Guarda Conjunta",null,null,"Ascendentes",null,null,null,{"$f":"E212+H212+K212+N212","v":0},"FA  ≥ 90%","◄Art.º 87.º  do CIRS, Dedução dos sujeitos passivos, dependentes, afilhados civis, deficientes das Forças Armadas, com grau de invalidez ≥ 90%;"]
[null,null,"≥ 60%",null,{"$f":"IF(E211>=1,0,IF(F209=1,F204,))","v":0},{"$f":"IF(F210>=1,0,'Modelo 3'!H20)","v":0},null,{"$f":"IF(H211>=1,0,IF(I209=1,I204,))","v":0},{"$f":"IF(I210>=1,0,'Modelo 3'!I20)","v":0},null,{"$f":"IF(L209>=1,L204*L209,)","v":0},{"$f":"'Modelo 3'!J20","v":0},null,{"$f":"IF(O209>=1,O204*O209,)","v":0},{"$f":"'Modelo 3'!K20","v":0},{"$f":"Q207*Q209","v":0},{"$f":"'Modelo 3'!K24","v":0},"SP A Separado",null,"SP A Separada",null,{"$f":"SUM(T204:T208)","v":0}]
[null,null," ≥ 90%",null,{"$f":"IF(E212>=1,0,IF(F210>=1,F204+F205,))","v":0},{"$f":"('Modelo 3'!H21)","v":0},null,{"$f":"IF(H212>=1,0,IF(I210>=1,I204+I205,))","v":0},{"$f":"'Modelo 3'!I21","v":0},null,{"$f":"IF(L210>=1,L204+L205*L210,)","v":0},{"$f":"'Modelo 3'!J21","v":0},null,{"$f":"IF(O210>=1,O204+O205*O210,)","v":0},{"$f":"'Modelo 3'!K21","v":0},null,null,null,"≥ 60%",{"$f":"IF(R202=0,0,E209)","v":0},"≥ 60%"]
[null,null," FA  ≥ 60%",null,{"$f":"IF(F211=1,F206,)","v":0},{"$f":"IF(F212=1,0,'Modelo 3'!H22)","v":0},null,{"$f":"IF(I211=1,I206,)","v":0},{"$f":"IF(I212>=1,0,'Modelo 3'!I22)","v":0},null,{"$f":"IF(L211>=1,L206*L211,)","v":0},{"$f":"'Modelo 3'!J22","v":0},null,{"$f":"IF(O211>=1,O206*O211,)","v":0},{"$f":"'Modelo 3'!K22","v":0},null,null,null," ≥ 90%",{"$f":"IF(R202=0,0,K209/2+N209/2)+P203","v":0},"≥ 60%"]
[null,null,"FA  ≥ 90%",null,{"$f":"IF(F212>=1,F206+F207,)","v":0},{"$f":"('Modelo 3'!H23)","v":0},null,{"$f":"IF(I212>=1,I206+I207,)","v":0},{"$f":"'Modelo 3'!I23","v":0},null,{"$f":"IF(L212>=1,(L206+L207)*L212,)","v":0},{"$f":"'Modelo 3'!J23","v":0},null,{"$f":"IF(O212>=1,O206+O207*O212,)","v":0},{"$f":"'Modelo 3'!K23","v":0},null,null,null," FA  ≥ 60%",{"$f":"IF(R202=0,0,E210+K210/2+N210/2)","v":0}," ≥ 90%"]
[null,"SOMA TOTAL →",null,{"$f":"MAX(E209:E212)","v":0},null,null,{"$f":"MAX(H209:H212)","v":0},null,null,{"$f":"SUM(K209:K212)","v":0},null,null,{"$f":"SUM(N209:N212)","v":0},null,null,{"$f":"SUM(P209:P212)","v":0},null,null,"FA  ≥ 90%",{"$f":"IF(R202=0,0,E211+K211/2+N211/2)","v":0}," FA  ≥ 60%"]
[null,"Continente ",null,"SOMA",{"$f":"SUM(D213:P213)","v":0},{"$f":"IF(S202=1,E214,)","v":0},null,null,"T. Separado",null,null,null,null,null,null,null,null,null,null,{"$f":"IF(R202=0,0,E212+K212/2+N212/2)","v":0},"FA  ≥ 90%",{"$f":"SUM(T210:T214)","v":0}]
[null,"Açores ",null,"SOMA",{"$f":"IF(E214<0,0,E214)","v":0},{"$f":"IF(S202=2,E215,)","v":0},null,"SP A→",{"$f":"IF(S202>=4,0,SUM(K215))","v":0},null,{"$f":"IF(R202=0,0,D203+J203+M203+P203)","v":0},null,{"$f":"E212+H212+K212+N212","v":0},null,null,null,null,null,null,"SP B Separado"]
[null,"Madeira",null,"SOMA",{"$f":"IF(E214<0,0,E214)","v":0},{"$f":"IF(S202=3,E216,)","v":0},null,"SP B→",{"$f":"IF(S202>=4,0,SUM(K216))","v":0},null,{"$f":"IF(R202=0,0,G203+J203+M203+P203)","v":0},null,{"$f":"E210+H210+K210+N210","v":0},null,null,null,null,null,null,{"$f":"IF(R202=0,0,H209)","v":0}]
[null,{"$f":"IF(E214<0,0,SUM(F214+F215+F216))","v":0},null,"← Dedução à coleta (Azul)",null,null,null,null,null,null,null,null,null,null,null,null,null,null,null,{"$f":"IF(R202=0,0,K209/2+N209/2)+P203","v":0},"≥ 60%"]
[null,null,null,null,null,null,null,null,null,null,null,null,null,null,null,null,null,null,null,{"$f":"IF(R202=0,0,H210+K210/2+N210/2)","v":0}," ≥ 90%"]
[null,"Art.º 87.º do CIRS - Contribuições  pagas para a reforma por velhice, dos sujeitos passivos com deficiência ≥ 60%",null,null,null,null,null,null,null,null,null,null,null,null,null,null,null,{"$f":"'Modelo 3'!D38","v":1},{"$f":"IF(S220=TRUE,4,IF(S221=TRUE,1,IF(S222=TRUE,1,'Anexo A'!S46)))","v":1},{"$f":"IF(R202=0,0,H211+K211/2+N211/2)","v":0}," FA  ≥ 60%"]
[null,"T.  Separada →",null,{"$f":"D226","v":0},null,{"$f":"F226","v":0},null,{"$f":"H226","v":0},null,{"$f":"J226","v":0},null,null,null,null,null,null,null,null,{"$f":"'Modelo 3'!D43","v":0},{"$f":"IF(R202=0,0,H212+K212/2+N212/2)","v":0},"FA  ≥ 90%",{"$f":"SUM(T216:T220)","v":0}]
[null,"Taxas →",null,0.25,null,null,null,0.125,null,null,null,null,null,null,null,null,null,null,{"$f":"'Modelo 3'!E43","v":0}]
[null,"Limites →",null,{"$f":"IF(D223=2,130,IF(D223=1,65,0))","v":130},null,null,null,{"$f":"D222/2","v":65},null,null,null,null,null,null,null,null,null,null,{"$f":"'Modelo 3'!F43","v":0},null,null,{"$f":"V214+V220","v":0}]
[null,"Quoficite Familiar →",null,{"$f":"'Modelo 3'!C59","v":2}]
[null,"despesas →",null,{"$f":"R22","v":0},null,{"$f":"T22","v":0},null,{"$f":"V22","v":0},null,{"$f":"IF(O8+Q8>=1,0,X22)","v":0},null,{"$f":"SUM(D220+F220)","v":0}]
[null,null,null,"Sujeito Passivo A ",null,"Sujeito Passivo B",null,"Dependentes",null,"Guarda Conjunta",null,{"$f":"IF(L224<D222,D220+F220,D222)","v":0},{"$f":"D222/2","v":65}]
[null,"SOMA TOTAL →",null,{"$f":"IF(D224*D221<D222,D224*D221,D222)+H226+J226","v":0},null,{"$f":"IF(F224*D221<D222,F224*D221,D222)+H226+J226","v":0},null,{"$f":"IF(H224*H221<H222,H224*H221,H222)","v":0},null,{"$f":"IF(J224*D221<D222,J224*D221,D222)*X20","v":0}]
[null,"Continente ",null,"SOMA",{"$f":"SUM(L225)","v":0},{"$f":"IF(S219=1,E227,)","v":0},null,null,"T. Separado"]
[null,"Açores ",null,"SOMA",{"$f":"IF(E227<0,0,E227)","v":0},{"$f":"IF(S219=2,E228,)","v":0},null,"SP A→",{"$f":"IF(S219>=4,0,SUM(K228))","v":0},null,{"$f":"IF(R219=0,0,SUM(L228))","v":0},{"$f":"IF(D220>=M225,M225,D220)","v":0}]
[null,"Madeira",null,"SOMA",{"$f":"IF(E227<0,0,E227)","v":0},{"$f":"IF(S219=3,E229,)","v":0},null,"SP B→",{"$f":"IF(S219>=4,0,SUM(K229))","v":0},null,{"$f":"IF(R219=0,0,SUM(L229))","v":0},{"$f":"IF(F220>=M225,M225,F220)","v":0}]
[null,{"$f":"IF(E227<0,0,SUM(F227+F228+F229))","v":0},null,"← Dedução à coleta (Azul)"]
[]
[null,"Art.º 87.º do CIRS -  Prémios de seguros de vida de deficientes",null,null,null,null,null,null,null,null,null,null,null,null,null,null,null,{"$f":"'Modelo 3'!D38","v":1},{"$f":"IF(S233=TRUE,4,IF(S234=TRUE,1,IF(S235=TRUE,1,'Anexo A'!S46)))","v":1}]
[null,"T.  Separada →",null,{"$f":"D238","v":0},null,{"$f":"F238","v":0},null,{"$f":"H238","v":0},null,{"$f":"J238","v":0},null,null,null,null,null,null,null,null,{"$f":"'Modelo 3'!D43","v":0}]
[null,"Taxas →",null,0.25,0.15,null,null,0.125,null,null,null,null,null,null,null,null,null,null,{"$f":"'Modelo 3'!E43","v":0}]
[null,"Coleta Total →",null,{"$f":"Simulação!G82","v":0},{"$f":"D235*E234","v":0},null,null,{"$f":"E235/2","v":0},null,null,null,null,null,null,null,null,null,null,{"$f":"'Modelo 3'!F43","v":0}]
[null,"Despesas  →",null,{"$f":"R23","v":0},null,{"$f":"T23","v":0},null,{"$f":"V23","v":0},null,{"$f":"IF(O8+Q8>=1,0,X23)","v":0},null,{"$f":"SUM(D233+F233)","v":0}]
[null,null,null,"Sujeito Passivo A ",null,"Sujeito Passivo B",null,"Dependentes",null,"Guarda Conjunta",null,{"$f":"IF(L236<E235,D233+F233,E235)","v":0},{"$f":"E235/2","v":0}]
[null,"SOMA TOTAL →",null,{"$f":"IF(D236*D234<E235,D236*D234,E235)+H238+J238","v":0},null,{"$f":"IF(F236*D234<E235,F236*D234,E235)+H238+J238","v":0},null,{"$f":"IF(H236*H234<H235,H236*H234,H235)","v":0},null,{"$f":"IF(J236*D234<D235,J236*D234,D235)*X20","v":0}]
[null,"Continente ",null,"SOMA",{"$f":"SUM(L237)","v":0},{"$f":"IF(S232=1,E239,)","v":0},null,null,"T. Separado"]
[null,"Açores ",null,"SOMA",{"$f":"IF(E239<0,0,E239)","v":0},{"$f":"IF(S232=2,E240,)","v":0},null,"SP A→",{"$f":"IF(S232>=4,0,SUM(K240))","v":0},null,{"$f":"IF(R232=0,0,SUM(L240))","v":0},{"$f":"IF(D233>=M237,M237,D233)","v":0}]
[null,"Madeira",null,"SOMA",{"$f":"IF(E239<0,0,E239)","v":0},{"$f":"IF(S232=3,E241,)","v":0},null,"SP B→",{"$f":"IF(S232>=4,0,SUM(K241))","v":0},null,{"$f":"IF(R232=0,0,SUM(L241))","v":0},{"$f":"IF(F233>=M237,M237,F233)","v":0}]
[null,{"$f":"IF(E239<0,0,SUM(F239+F240+F241))","v":0},null,"← Dedução à coleta (Azul)"]
[]
[null,"Art.º 87.º do CIRS - Despesas com educação e reabilitação dos sujeitos passivos e dependentes  deficientes",null,null,null,null,null,null,null,null,null,null,null,null,null,null,null,{"$f":"'Modelo 3'!D38","v":1},{"$f":"IF(S245=TRUE,4,IF(S246=TRUE,1,IF(S247=TRUE,1,'Anexo A'!S46)))","v":1}]
[null,"T.  Separada →",null,{"$f":"D249","v":0},null,{"$f":"F249","v":0},null,{"$f":"H249","v":0},null,{"$f":"J249","v":0},null,null,null,null,null,null,null,null,{"$f":"'Modelo 3'!D43","v":0}]
[null,"Taxas →",null,0.3,null,null,null,0.15,null,0.15,null,null,null,null,null,null,null,null,{"$f":"'Modelo 3'!E43","v":0}]
[null,"Despesas  →",null,{"$f":"R24","v":0},null,{"$f":"T24","v":0},null,{"$f":"V24","v":0},null,{"$f":"IF(O8+Q8>=1,0,X24)","v":0},null,{"$f":"SUM(D245+F245)","v":0},null,null,null,null,null,null,{"$f":"'Modelo 3'!F43","v":0}]
[null,null,null,"Sujeito Passivo A ",null,"Sujeito Passivo B",null,"Dependentes",null,"Guarda Conjunta",null,{"$f":"D245+F245","v":0},{"$f":"L248","v":0}]
[null,"SOMA TOTAL →",null,{"$f":"(D247*D246)+H249+J249","v":0},null,{"$f":"(F247*D246)+H249+J249","v":0},null,{"$f":"H247*H246","v":0},null,{"$f":"(J247*J246)*X20","v":0}]
[null,"Continente ",null,"SOMA",{"$f":"SUM(L248)","v":0},{"$f":"IF(S244=1,E250,)","v":0},null,null,"T. Separado"]
[null,"Açores ",null,"SOMA",{"$f":"IF(E250<0,0,E250)","v":0},{"$f":"IF(S244=2,E251,)","v":0},null,"SP A→",{"$f":"IF(S244>=4,0,SUM(K251))","v":0},null,{"$f":"IF(R244=0,0,SUM(L251))","v":0},{"$f":"IF(D245>=M248,M248,D245)","v":0}]
[null,"Madeira",null,"SOMA",{"$f":"IF(E250<0,0,E250)","v":0},{"$f":"IF(S244=3,E252,)","v":0},null,"SP B→",{"$f":"IF(S244>=4,0,SUM(K252))","v":0},null,{"$f":"IF(R244=0,0,SUM(L252))","v":0},{"$f":"IF(F245>=M248,M248,F245)","v":0}]
[null,{"$f":"IF(E250<0,0,SUM(F250+F251+F252))","v":0},null,"← Dedução à coleta (Azul)"]
[]
[null,"DEDUÇÕES À COLETA BENEFÍCIOS FISCAIS"]
[null," Art.º 16º,21.º EBF - PPR - Planos individuais de poupança-reforma +PPR/E",null,null,null,null,null,null,null,null,null,null,null,null,null,null,null,{"$f":"'Modelo 3'!D38","v":1},{"$f":"IF(S261=TRUE,4,IF(S262=TRUE,1,IF(S263=TRUE,1,'Anexo A'!S46)))","v":1}]
[null,"T.  Separada →",null,{"$f":"D262+H262+L262","v":0},null,{"$f":"F262+J262+N262","v":0},null,null,null,null,null,null,null,null,"Reformado",null,"Resgate PPR","Conjunta","Separda"]
[null,"Taxas →",null,0.2,null,null,null,null,null,null,null,null,null,null,"SP A→",{"$f":"'Anexo A'!O22+'Anexo A'!O23","v":0},"SP A→",{"$f":"V54+X54","v":0},{"$f":"IF(R256=1,V54,)","v":0}]
[null,"Limites →",null,null,null,400,null,null,null,350,null,null,null,300,"SP B→",{"$f":"'Anexo A'!Q22+'Anexo A'!Q23","v":0},"SP B→",null,{"$f":"IF(R256=1,X54,)","v":0}]
[null,"Valor aplicada →",null,{"$f":"IF(C74=1,O16,)","v":0},null,{"$f":"IF(F74=1,Q16,)","v":0},null,{"$f":"IF(C74=2,O16,)","v":0},null,{"$f":"IF(F74=2,Q16,)","v":0},null,{"$f":"IF(C74=3,O16,)","v":0},null,{"$f":"IF(F74=3,Q16,)","v":0}]
[null,null,null,"S. Passivo A <35 ",null,"S. Passivo B <35 ",null,"S. Passivo A >35<50",null,"S. Passivo B >35<50",null,"S. Passivo A  >50",null,"S. Passivo B >50",null,null,null,null,{"$f":"'Modelo 3'!D43","v":0}]
[null,"SOMA TOTAL →",null,{"$f":"IF(P258>=1,0,IF(D260*D258<F259,D260*D258,F259))","v":0},null,{"$f":"IF(P259>=1,0,IF(F260*D258<F259,F260*D258,F259))","v":0},null,{"$f":"IF(P258>=1,0,IF(H260*D258<J259,H260*D258,J259))","v":0},null,{"$f":"IF(P259>=1,0,IF(J260*D258<J259,J260*D258,J259))","v":0},null,{"$f":"IF(P258>=1,0,IF(L260*D258<N259,L260*D258,N259))","v":0},null,{"$f":"IF(P259>=1,0,IF(N260*D258<N259,N260*D258,N259))","v":0},null,null,null,null,{"$f":"'Modelo 3'!E43","v":0}]
[null,"Continente ",null,"SOMA",{"$f":"SUM(D262:O262)","v":0},{"$f":"IF(S256=1,E263,)","v":0},null,null,"T. Separado",null,null,null,null,null,null,null,null,null,{"$f":"'Modelo 3'!F43","v":0}]
[null,"Açores ",null,"SOMA",{"$f":"IF(E263<0,0,E263)","v":0},{"$f":"IF(S256=2,E264,)","v":0},null,"SP A→",{"$f":"IF(S256>=4,0,SUM(K264))","v":0},null,{"$f":"IF(R256=0,0,D257)","v":0}]
[null,"Madeira",null,"SOMA",{"$f":"IF(E263<0,0,E263)","v":0},{"$f":"IF(S256=3,E265,)","v":0},null,"SP B→",{"$f":"IF(S256>=4,0,SUM(K265))","v":0},null,{"$f":"IF(R256=0,0,F257)","v":0}]
[null,{"$f":"IF(E263<0,0,SUM(F263+F264+F265))","v":0},null,"← Dedução à Coleta (Vermelho)"]
[]
[null,"Art.º 17.º do EBF - Valores aplicados em contas individuais geridas em regime público de capitalização",null,null,null,null,null,null,null,null,null,null,null,null,null,null,null,{"$f":"'Modelo 3'!D38","v":1},{"$f":"IF(S269=TRUE,4,IF(S270=TRUE,1,IF(S271=TRUE,1,'Anexo A'!S46)))","v":1}]
[null,"T.  Separada →",null,{"$f":"D274+H274","v":0},null,{"$f":"F274+J274","v":0},null,null,null,null,null,null,null,null,null,null,null,null,{"$f":"'Modelo 3'!D43","v":0}]
[null,"Taxas →",null,0.2,null,null,null,null,null,null,null,null,null,null,null,null,null,null,{"$f":"'Modelo 3'!E43","v":0}]
[null,"Limites →",null,null,null,400,null,null,null,350,null,null,null,null,null,null,null,null,{"$f":"'Modelo 3'!F43","v":0}]
[null,"Valor aplicado →",null,{"$f":"IF(I73=1,O18,)","v":0},null,{"$f":"IF(L73=1,Q18,)","v":0},null,{"$f":"IF(I73=2,O18,)","v":0},null,{"$f":"IF(L73=2,Q18,)","v":0}]
[null,null,null,"S. Passivo A <35 ",null,"S. Passivo B <35 ",null,"S. Passivo A ≥ 35",null,"S. Passivo B ≥ 35"]
[null,"SOMA TOTAL →",null,{"$f":"IF(D272*D270<F271,D272*D270,F271)","v":0},null,{"$f":"IF(F272*D270<F271,F272*D270,F271)","v":0},null,{"$f":"IF(H272*D270<J271,H272*D270,J271)","v":0},null,{"$f":"IF(J272*D270<J271,J272*D270,J271)","v":0}]
[null,"Continente ",null,"SOMA",{"$f":"SUM(D274:K274)","v":0},{"$f":"IF(S268=1,E275,)","v":0},null,null,"T. Separado"]
[null,"Açores ",null,"SOMA",{"$f":"IF(E275<0,0,E275)","v":0},{"$f":"IF(S268=2,E276,)","v":0},null,"SP A→",{"$f":"IF(S268>=4,0,SUM(K276))","v":0},null,{"$f":"IF(R268=0,0,D269)","v":0}]
[null,"Madeira",null,"SOMA",{"$f":"IF(E275<0,0,E275)","v":0},{"$f":"IF(S268=3,E277,)","v":0},null,"SP B→",{"$f":"IF(S268>=4,0,SUM(K277))","v":0},null,{"$f":"IF(R268=0,0,F269)","v":0}]
[null,{"$f":"IF(E275<0,0,SUM(F275+F276+F277))","v":0},null,"← Dedução à Coleta (Vermelho)"]
[]
[null,"Art.º 71.º do EBF - Encargos suportados com a reabilitação de imóveis",null,null,null,null,null,null,null,null,null,null,null,null,null,null,null,{"$f":"'Modelo 3'!D38","v":1},{"$f":"IF(S281=TRUE,4,IF(S282=TRUE,1,IF(S283=TRUE,1,'Anexo A'!S46)))","v":1}]
[null,"T.  Separada →",null,{"$f":"D286","v":0},null,{"$f":"F286","v":0},null,{"$f":"H286","v":0},null,null,null,null,null,null,null,null,null,null,{"$f":"'Modelo 3'!D43","v":0}]
[null,"Taxas →",null,0.3,null,null,null,0.15,null,null,null,null,null,null,null,null,null,null,{"$f":"'Modelo 3'!E43","v":0}]
[null,"Limites →",null,500,null,null,null,null,null,null,null,null,null,null,null,null,null,null,{"$f":"'Modelo 3'!F43","v":0}]
[null,"Valor aplicado →",null,{"$f":"R25","v":0},null,{"$f":"T25","v":0},null,{"$f":"V25","v":0}]
[null,null,null,"Sujeito Passivo A ",null,"Sujeito Passivo B",null,"Dependentes",null,{"$f":"IF(D286+F286+H286,IF(P288>=D283,D283,P288))","v":false},null,null,null,null,null,null,{"$f":"J285","v":false},"%","Porpocão"]
[null,"SOMA TOTAL →",null,{"$f":"IF(D284*D282<D283,D284*D282,D283)","v":0},null,{"$f":"IF(F284*D282<D283,F284*D282,D283)","v":0},null,{"$f":"IF(H284*H282<D283,H284*H282,D283)","v":0},null,null,null,null,null,null,"SP A →",{"$f":"SUM(D281+H281)","v":0},{"$f":"SUM(D284+H284)","v":0},{"$f":"IFERROR(Q286/Q288,0)","v":0},{"$f":"Q285*R286","v":0}]
[null,"Continente ",null,"SOMA",{"$f":"SUM(J285)","v":0},{"$f":"IF(S280=1,E287,)","v":0},null,null,"T. Separado",null,null,null,null,null,"SP B →",{"$f":"SUM(F281+H281)","v":0},{"$f":"SUM(F284+H284)","v":0},{"$f":"IFERROR(Q287/Q288,0)","v":0},{"$f":"Q285*R287","v":0}]
[null,"Açores ",null,"SOMA",{"$f":"IF(E287<0,0,E287)","v":0},{"$f":"IF(S280=2,E288,)","v":0},null,"SP A→",{"$f":"IF(S280>=4,0,SUM(K288))","v":0},null,{"$f":"IF(R280=0,0,S286)","v":0},null,null,null,null,{"$f":"SUM(P286:P287)","v":0},{"$f":"SUM(Q286:Q287)","v":0},{"$f":"SUM(R286:R287)","v":0},{"$f":"SUM(S286:S287)","v":0}]
[null,"Madeira",null,"SOMA",{"$f":"IF(E287<0,0,E287)","v":0},{"$f":"IF(S280=3,E289,)","v":0},null,"SP B→",{"$f":"IF(S280>=4,0,SUM(K289))","v":0},null,{"$f":"IF(R280=0,0,S287)","v":0}]
[null,{"$f":"IF(E287<0,0,SUM(F287+F288+F289))","v":0},null,"← Dedução à Coleta (Vermelho)"]
[]
[null,"DONATIVOS"]
[null,"Donativos a Instituições particulares.",null,null,null,null,null,null,null,null,null,null,null,null,null,null,null,{"$f":"'Modelo 3'!D38","v":1},{"$f":"IF(S294=TRUE,4,IF(S295=TRUE,1,IF(S296=TRUE,1,'Anexo A'!S46)))","v":1}]
[null,"T.  Separada →",null,{"$f":"D304","v":0},null,{"$f":"F304","v":0},null,{"$f":"H304","v":0},null,null,null,null,null,null,null,null,null,null,{"$f":"'Modelo 3'!D43","v":0}]
[null,"Taxas →",null,0.25,0.15,null,null,0.125,null,null,null,null,null,null,null,null,null,null,{"$f":"'Modelo 3'!E43","v":0}]
[null,"Coleta Total →",null,{"$f":"Simulação!G82","v":0},{"$f":"D296*E295","v":0},null,null,null,null,null,null,null,null,null,null,null,null,null,{"$f":"'Modelo 3'!F43","v":0}]
[null,null,null,"Sujeito Passivo A ",null,"Sujeito Passivo B",null,"Dependentes",null,{"$f":"IF(D304+F304+H304,IF(Q300>=E296,E296,P300))","v":false},null,null,null,null,null,null,{"$f":"J297","v":false},"%","Porpocão"]
[null,"Código 608",1.3,{"$f":"R26*C298*D295","v":0},null,{"$f":"T26*C298*D295","v":0},null,{"$f":"V26+X26*C298*H295","v":0},null,null,null,null,null,null,"SP A →",{"$f":"SUM(D294+H294)","v":0},{"$f":"SUM(R26:S31,V26:W31,X26:Y31)","v":0},{"$f":"IFERROR(Q298/Q300,0)","v":0},{"$f":"Q297*R298","v":0}]
[null,"Código 611",1.2,{"$f":"R27*C299*D295","v":0},null,{"$f":"T27*C299*D295","v":0},null,{"$f":"V27+X27*C299*H295","v":0},null,null,null,null,null,null,"SP B →",{"$f":"SUM(F294+H294)","v":0},{"$f":"SUM(T26:U31,V26:W31,X26:Y31)","v":0},{"$f":"IFERROR(Q299/Q300,0)","v":0},{"$f":"Q297*R299","v":0}]
[null,"Código 612",1.3,{"$f":"R28*C300*D295","v":0},null,{"$f":"T28*C300*D295","v":0},null,{"$f":"V28+X28*C300*H295","v":0},null,null,null,null,null,null,null,{"$f":"SUM(P298:P299)","v":0},{"$f":"SUM(Q298:Q299)","v":0},{"$f":"SUM(R298:R299)","v":0},{"$f":"SUM(S298:S299)","v":0}]
[null,"Código 613",1.3,{"$f":"R29*C301*D295","v":0},null,{"$f":"T29*C301*D295","v":0},null,{"$f":"V29+X29*C301*H295","v":0}]
[null,"Código 614",1.4,{"$f":"R30*C302*D295","v":0},null,{"$f":"T30*C302*D295","v":0},null,{"$f":"V30+X30*C302*H295","v":0}]
[null,"Código 615",1.5,{"$f":"R31*C303*D295","v":0},null,{"$f":"T31*C303*D295","v":0},null,{"$f":"V31+X31*C303*H295","v":0}]
[null,"SOMA TOTAL →",null,{"$f":"IF(D298+D299+D300+D301+D302+D303>=E296,E296,IF(D298+D299+D300+D301+D302+D303<E296,D298+D299+D300+D301+D302+D303))","v":0},null,{"$f":"IF(F298+F299+F300+F301+F302+F303>=E296,E296,IF(F298+F299+F300+F301+F302+F303<E296,F298+F299+F300+F301+F302+F303))","v":0},null,{"$f":"IF(H298+H299+H300+H301+H302+H303>=E296,E296,IF(H298+H299+H300+H301+H302+H303<E296,H298+H298+H300+H301+H302+H303))","v":0}]
[null,"Continente ",null,"SOMA",{"$f":"SUM(J297)","v":0},{"$f":"IF(S293=1,E305,)","v":0},null,null,"T. Separado"]
[null,"Açores ",null,"SOMA",{"$f":"IF(E305<0,0,E305)","v":0},{"$f":"IF(S293=2,E306,)","v":0},null,"SP A→",{"$f":"IF(S293>=4,0,SUM(K306))","v":0},null,{"$f":"IF(R293=0,0,S298)","v":0}]
[null,"Madeira",null,"SOMA",{"$f":"IF(E305<0,0,E305)","v":0},{"$f":"IF(S293=3,E307,)","v":0},null,"SP B→",{"$f":"IF(S293>=4,0,SUM(K307))","v":0},null,{"$f":"IF(R293=0,0,S299)","v":0}]
[null,{"$f":"IF(E305<0,0,SUM(F305+F306+F307))","v":0},null,"← Dedução à Coleta (Vermelho)"]
[]
[null,"Donativos ao Estado",null,null,null,null,null,null,null,null,null,null,null,null,null,null,null,{"$f":"'Modelo 3'!D38","v":1},{"$f":"IF(S311=TRUE,4,IF(S312=TRUE,1,IF(S313=TRUE,1,'Anexo A'!S46)))","v":1}]
[null,"T.  Separada →",null,{"$f":"D318","v":0},null,{"$f":"F318","v":0},null,{"$f":"H318/2","v":0},null,null,null,null,null,null,null,null,null,null,{"$f":"'Modelo 3'!D43","v":0}]
[null,"Taxas →",null,0.25,null,null,null,0.125,null,null,null,null,null,null,null,null,null,null,{"$f":"'Modelo 3'!E43","v":0}]
[null,null,null,"Sujeito Passivo A ",null,"Sujeito Passivo B",null,"Dependentes",null,null,null,null,null,null,null,null,null,null,{"$f":"'Modelo 3'!F43","v":0}]
[null,"Código 620",1.2,{"$f":"R32*C314*D312","v":0},null,{"$f":"T32*C314*D312","v":0},null,{"$f":"V32+X32*C314*H312","v":0}]
[null,"Código 621",1.3,{"$f":"R33*C315*D312","v":0},null,{"$f":"T33*C315*D312","v":0},null,{"$f":"V33+X33*C315*H312","v":0}]
[null,"Código 622",1.4,{"$f":"R34*C316*D312","v":0},null,{"$f":"T34*C316*D312","v":0},null,{"$f":"V34+X34*C316*H312","v":0}]
[null,"Código 623",1.5,{"$f":"R35*C317*D312","v":0},null,{"$f":"T35*C317*D312","v":0},null,{"$f":"V35+X35*C317*H312","v":0}]
[null,"SOMA TOTAL →",null,{"$f":"SUM(D314:D317)","v":0},null,{"$f":"SUM(F314:F317)","v":0},null,{"$f":"SUM(H314:H317)","v":0}]
[null,"Continente ",null,"SOMA",{"$f":"SUM(D318:H318)","v":0},{"$f":"IF(S310=1,E319,)","v":0},null,null,"T. Separado"]
[null,"Açores ",null,"SOMA",{"$f":"IF(E319<0,0,E319)","v":0},{"$f":"IF(S310=2,E320,)","v":0},null,"SP A→",{"$f":"IF(S310>=4,0,SUM(K320))","v":0},null,{"$f":"IF(R310=0,0,D311+H311)","v":0}]
[null,"Madeira",null,"SOMA",{"$f":"IF(E319<0,0,E319)","v":0},{"$f":"IF(S310=3,E321,)","v":0},null,"SP B→",{"$f":"IF(S310>=4,0,SUM(K321))","v":0},null,{"$f":"IF(R310=0,0,F311+H311)","v":0}]
[null,{"$f":"IF(E319<0,0,SUM(F319+F320+F321))","v":0},null,"← Dedução à Coleta (Vermelho)"]
[]
[null,"BENEFÍCIO MUNICIPAL"]
[null,"Benefício Municipal",null,null,null,null,null,null,null,null,null,null,null,null,null,null,null,{"$f":"'Modelo 3'!D38","v":1},{"$f":"IF(S326=TRUE,4,IF(S327=TRUE,1,IF(S328=TRUE,1,'Anexo A'!S46)))","v":1}]
[null,"Coleta Líquida →",null,{"$f":"IF(Simulação!G89=0,0,Simulação!G89)-Simulação!G81","v":0},null,{"$f":"IF(Simulação!H89=0,0,Simulação!H89)-Simulação!H81","v":0},null,{"$f":"IF(Simulação!I89=0,0,Simulação!I89)-Simulação!I81","v":0},null,null,null,null,null,null,null,null,null,null,{"$f":"'Modelo 3'!D43","v":0}]
[null,"Taxa Municipio →",null,{"$f":"'Modelo 3'!F12","v":0},null,null,null,null,null,null,null,null,null,null,null,null,null,null,{"$f":"'Modelo 3'!E43","v":0}]
[null,null,null,"Sujeito Passivo A + B",null,"Sujeito Passivo A",null,"Sujeito Passivo B",null,null,null,null,null,null,null,null,null,null,{"$f":"'Modelo 3'!F43","v":0}]
[null,"SOMA TOTAL →",null,{"$f":"IF(S325>=4,0,(D326*D327))","v":0},null,{"$f":"IF(S325>=4,0,(F326*D327))","v":0},null,{"$f":"IF(S325>=4,0,(H326*D327))","v":0}]
[null,{"$f":"SUM(D326*D327)","v":0}]
[null,{"$f":"SUM(F326*D327)","v":0}]
[null,{"$f":"SUM(H326*D327)","v":0}]
[]
[null,"Art.º 78.º do CIRS - Teto Máximo das deduções à Coleta"]
[null,"Taxa →",null,0.05]
[null,"N.º de Filhos → ",null,{"$f":"'Modelo 3'!G16+'Modelo 3'!H16+'Modelo 3'!I16+'Modelo 3'!J16+'Modelo 3'!G17+'Modelo 3'!H17+'Modelo 3'!I17+'Modelo 3'!J17","v":0}]
[null,"Limites →",null,2500,1000,{"$f":"D337-E337","v":1500},80640,7091,{"$f":"G337-H337","v":73549}]
[null,null,null,7091,80640,1000,1500]
[null,"Rend. Coletável →",null,{"$f":"Simulação!G74","v":0},null,null,{"$f":"Simulação!H74","v":0},null,null,{"$f":"Simulação!I74","v":0}]
[null,null,null,"Sujeito Passivo A + B",null,null,"Sujeito Passivo A ",null,null,"Sujeito Passivo B"]
[null,null,null,{"$f":"IF(D336<3,IF(D339<D338,\"Sem limite\",IF(D339>E338,F338,(F338+((G338)*((E338-D339)/I337))))),IF(D339<D338,\"Sem limite\",IF(D339>E338,(F338+(D336*D335)*F338),((D336*D335+1)*(F338+((G338)*((E338-D339)/I337)))))))","v":"Sem limite"},null,null,{"$f":"IF(D336<3,IF(G339<D338,\"Sem limite\",IF(G339>E338,F338,(F338+((G338)*((E338-G339)/I337))))),IF(G339<D338,\"Sem limite\",IF(G339>E338,(F338+(D336*D335)*F338),((D336*D335+1)*(F338+((G338)*((E338-G339)/I337)))))))","v":"Sem limite"},null,null,{"$f":"IF(D336<3,IF(J339<D338,\"Sem limite\",IF(J339>E338,F338,(F338+((G338)*((E338-J339)/I337))))),IF(J339<D338,\"Sem limite\",IF(J339>E338,(F338+(D336*D335)*F338),((D336*D335+1)*(F338+((G338)*((E338-J339)/I337)))))))","v":"Sem limite"}]
[null,"Limites a deduzir →",null,{"$f":"IF(D339=0,0,IF(D341>D343,D343,IF(D341<=D343,D341,)))","v":0},null,null,{"$f":"IF(G339=0,0,IF(G341>G343,G343,IF(G341<=G343,G341,)))","v":0},null,null,{"$f":"IF(J339=0,0,IF(J341>J343,J343,IF(J341<=J343,J341,)))","v":0}]
[null,"Somas a Vermelho →",null,{"$f":"SUM(B123+B138+B151+B164+B177+B188+B200+B266+B278+B290+B308+B322)","v":0},"Somas a Vermelho →",null,{"$f":"SUM(I121+I136+I149+I162+I175+I186+I198+I264+I276+I288+I306+I320)","v":0},"Somas a Vermelho →",null,{"$f":"SUM(I122+I137+I150+I163+I176+I187+I199+I265+I277+I289+I307+I321)","v":0}]
[null,"Somas  a Azul →",null,{"$f":"SUM(B90+B99+B111+B217+B230+B242+B253)","v":0},"Somas  a Azul →",null,{"$f":"SUM(I88+I97+I109+I215+I228+I240+I251)","v":0},"Somas  a Azul →",null,{"$f":"SUM(I89+I98+I110+I216+I229+I241+I252)","v":0}]
[null,"SOMA TOTAL →",null,{"$f":"SUM(D344,E345)","v":0},{"$f":"IF(D342=0,D343,IF(D343>D342,D342,IF(D343<=D342,D343)))","v":0},null,{"$f":"SUM(G344,H345)","v":0},{"$f":"IF(G342=0,G343,IF(G343>G342,G342,IF(G343<=G342,G343)))","v":0},null,{"$f":"SUM(J344,K345)","v":0},{"$f":"IF(J342=0,J343,IF(J343>J342,J342,IF(J343<=J342,J343)))","v":0}]
[]
[]
[]
[]
[null,"FIM"]

{"sheet":"Anexo J","index":8,"n_rows":49,"n_cols":17,"rows_kept":49,"cut":false,"hidden":false,"merged":[[28,14,28,15],[29,14,29,15],[32,14,32,15],[33,14,33,15],[34,14,34,15],[35,14,35,15],[36,14,36,15],[37,14,37,15],[13,11,13,12],[13,13,13,14],[14,11,14,12],[14,13,14,14],[29,12,29,13],[30,12,30,13],[35,12,35,13],[12,11,12,12],[12,13,12,14],[0,20,1,23],[10,1,10,6],[11,11,11,12],[11,13,11,14],[6,11,6,12],[7,11,7,12],[8,11,8,12],[6,13,6,14],[7,13,7,14],[8,13,8,14],[3,1,3,6],[5,11,5,12],[5,13,5,14],[21,1,21,6],[24,1,24,2],[24,3,24,4],[24,5,24,6],[22,1,22,2],[22,8,22,9],[21,8,21,13],[22,10,22,11],[23,8,23,13],[24,8,24,9],[24,10,24,11],[24,12,24,13],[22,12,22,13],[27,1,27,2],[28,1,28,4],[26,3,26,4],[26,5,26,6],[27,3,27,4],[27,5,27,6],[28,5,28,6],[22,5,22,6],[23,1,23,6],[25,1,25,2],[25,3,25,4],[25,5,25,6],[22,3,22,4],[26,1,26,2],[27,8,27,9],[27,10,27,11],[27,12,27,13],[28,8,28,11],[28,12,28,13],[25,8,25,9],[25,10,25,11],[25,12,25,13],[26,8,26,9],[26,10,26,11],[26,12,26,13],[33,1,33,2],[33,3,33,4],[33,5,33,6],[34,1,34,2],[29,8,29,9],[29,10,29,11],[30,8,30,9],[30,10,30,11],[31,1,31,6],[31,8,31,13],[32,10,32,11],[32,12,32,13],[33,10,33,11],[33,12,33,13],[34,10,34,11],[34,12,34,13],[30,1,30,2],[30,3,30,4],[29,1,29,2],[29,3,29,4],[29,5,29,6],[30,5,30,6],[32,1,32,2],[32,3,32,4],[32,8,32,9],[33,8,33,9],[34,8,34,9],[35,8,35,9],[43,4,43,5],[36,12,36,13],[37,8,37,9],[37,10,37,11],[38,8,38,9],[38,10,38,11],[37,12,37,13],[38,12,38,13],[34,3,34,4],[34,5,34,6],[32,5,32,6],[35,1,35,2],[35,3,35,4],[35,5,35,6],[36,5,36,6],[37,1,37,2],[37,3,37,4],[38,1,38,2],[38,3,38,4],[36,8,36,11],[37,5,37,6],[38,5,38,6],[36,1,36,4],[35,10,35,11]]}
[]
[]
[]
[null,"QUADRO 4A"]
[null,"RENDIMENTOS, RETENÇÕES, CONTRIBUIÇÕES OBRIGATÓRIAS"]
[null," TRABALHO DEPENDENTE OBTIDO NO ESTRANGEIRO",null,null,null,null,null,null,null,null,"Campo","Sujeito Passivo A",null,"Sujeito Passivo B"]
[null,"Trabalho dependente obtido no estrangeiro",null,null,null,null,null,null,null,null,"A01"]
[null,"Contribuições para a segurança social"]
[null,"IRS pago no estrangeiro"]
[]
[null,"QUADRO 5A"]
[null,"PENSÕES OBTIDAS NO ESTRANGEIRO ",null,null,null,null,null,null,null,null,"Campo","Sujeito Passivo A",null,"Sujeito Passivo B"]
[null,"Pensões da categoria H obtidas no estrangeiro       ",null,null,null,null,null,null,null,null,"H01"]
[null,"Contribuições para a segurança social"]
[null,"IRS pago no estrangeiro."]
[]
[]
[]
[]
[null,"INICIO"]
[null,{"$f":"IF(L7+N7+L13+N13=0,\"➤\",IF(L7+N7+L13+N13>=1,\"Tem\",))","v":"➤"}]
[null,"Anexo J - Cálculo do Crédito do Imposto",null,null,null,null,null,null,"Anexo J - Cálculo do Crédito do Imposto"]
[null,{"$f":"'Modelo 3'!J36","v":4104},null,{"$f":"IF(D26=0,0,IF(L8<=B23,B23,IF(L8>B23,L8,)))","v":0},null,{"$f":"IF(D34=0,0,IF(L8<=B23,B23,IF(L8>B23,L8,)))","v":0},null,null,{"$f":"'Modelo 3'!J36","v":4104},null,{"$f":"IF(K26=0,0,IF(N8<=I23,I23,IF(N8>I23,N8,)))","v":0},null,{"$f":"IF(K34=0,0,IF(N8<=I23,I23,IF(N8>I23,N8,)))","v":0}]
[null,"Sujeito Passivo A: Cat. A",null,null,null,null,null,null,"Sujeito Passivo B: Cat. A"]
[null,"R. Portugal",null,"R. Estrangeiro",null,"Soma",null,{"$f":"'Anexo A'!O7+'Anexo H'!V54+'Anexo H'!S258","v":0},"R. Portugal",null,"R. Estrangeiro",null,"Soma"]
[null,{"$f":"IF(D26=0,0,SUM(H25))","v":0},null,{"$f":"SUM(L7)","v":0},null,{"$f":"SUM(B26+D26)","v":0},null,{"$f":"'Anexo A'!Q7+'Anexo H'!X54+'Anexo H'!S259","v":0},{"$f":"IF(K26=0,0,SUM(H26))","v":0},null,{"$f":"SUM(N7)","v":0},null,{"$f":"SUM(I26+K26)","v":0}]
[null,{"$f":"IF(B26=0,0,SUM(H25))","v":0},null,{"$f":"IF(D26<=D23,D26,D23)","v":0},null,{"$f":"(D26-D27)/'Modelo 3'!C59","v":0},null,null,{"$f":"IF(I26=0,0,SUM(H26))","v":0},null,{"$f":"IF(K26<=K23,K26,K23)","v":0},null,{"$f":"(K26-K27)/'Modelo 3'!C59","v":0}]
[null,{"$f":"IF(B26=0,0,SUM(B27))","v":0},null,{"$f":"IF(D26=0,0,IF(F27>D27,F27,IF(D26<D27,D26,IF(D26>=D27,D27,))))","v":0},null,{"$f":"SUM(B28:E28)","v":0},null,null,{"$f":"IF(I26=0,0,SUM(I27))","v":0},null,{"$f":"IF(K26=0,0,IF(M27>K27,M27,IF(K26<K27,K26,IF(K26>=K27,K27,))))","v":0},null,{"$f":"SUM(I28:L28)","v":0}]
[null,"IRS Pago no estrangeiro →",null,null,null,{"$f":"L9","v":0},null,null,"IRS Pago no estrangeiro →",null,null,null,{"$f":"N9","v":0},null,{"$f":"Simulação!G72","v":0},null,"Rendimento coletável  Sujeito passivo A + B"]
[null,{"$f":"IFERROR(D26/F26,0)","v":0},null,{"$f":"D26-D27*B30","v":0},null,{"$f":"IF(O29=0,0,IF(D30>1,D30/O29)*(O33-O34))","v":0},null,null,{"$f":"IFERROR(K26/M26,0)","v":0},null,{"$f":"K26-K27*I30","v":0},null,{"$f":"IF(O29=0,0,IF(K30>1,K30/O29)*(O33-O34))","v":0},null,{"$f":"Simulação!H72","v":0},null,"Rendimento coletável Sujeito passivo A"]
[null,{"$f":"IFERROR(D26/F26,0)","v":0},null,{"$f":"D26-D27*B31","v":0},null,{"$f":"IF(O30=0,0,IF(D31>1,D31/O30)*(O35-O36))","v":0},null,null,{"$f":"IFERROR(K26/M26,0)","v":0},null,{"$f":"K26-K27*I31","v":0},null,{"$f":"IF(O30=0,0,IF(K31>1,K31/O30)*(O35-O36))","v":0}]
[null,"Sujeito Passivo A: Cat. H",null,null,null,null,null,null,"Sujeito Passivo B: Cat. H"]
[null,"R. Portugal",null,"R. Estrangeiro",null,"Soma",null,{"$f":"'Anexo A'!O22+'Anexo A'!O23+'Anexo A'!O24+'Anexo A'!O26","v":0},"R. Portugal",null,"R. Estrangeiro",null,"Soma",null,{"$f":"Simulação!G82","v":0},null,"Coleta total Sujeito passivo A + B"]
[null,{"$f":"IF(D34=0,0,(SUM(H33)))","v":0},null,{"$f":"SUM(L13)","v":0},null,{"$f":"SUM(B34+D34)","v":0},null,{"$f":"'Anexo A'!Q22+'Anexo A'!Q23+'Anexo A'!Q24+'Anexo A'!Q26","v":0},{"$f":"IF(K34=0,0,SUM(H34))","v":0},null,{"$f":"SUM(N13)","v":0},null,{"$f":"SUM(I34+K34)","v":0},null,{"$f":"Simulação!G83","v":0},null,"Deduções à coleta Sujeito passivo A + B"]
[null,{"$f":"IF(B34=0,0,SUM(H33))","v":0},null,{"$f":"IF(D34<=F23,D34,F23)","v":0},null,{"$f":"(D34-D35)/'Modelo 3'!C59","v":0},null,null,{"$f":"IF(I34=0,0,SUM(H34))","v":0},null,{"$f":"IF(K34<=M23,K34,M23)","v":0},null,{"$f":"(K34-K35)/'Modelo 3'!C59","v":0},null,{"$f":"Simulação!H82","v":0},null,"Coleta total Sujeito passivo A"]
[null,{"$f":"IF(B34=0,0,SUM(B35))","v":0},null,{"$f":"IF(D34=0,0,IF(F35>D35,F35,IF(D34<D35,D34,IF(D34>=D35,D35,))))","v":0},null,{"$f":"SUM(B36:E36)","v":0},null,null,{"$f":"IF(I34=0,0,SUM(I35))","v":0},null,{"$f":"IF(K34=0,0,IF(M35>K35,M35,IF(K34<K35,K34,IF(K34>=K35,K35,))))","v":0},null,{"$f":"SUM(I36:L36)","v":0},null,{"$f":"Simulação!H83","v":0},null,"Deduções à coleta Sujeito passivo A"]
[null,"IRS Pago no estrangeiro →",null,null,null,{"$f":"L15","v":0},null,null,"IRS Pago no estrangeiro →",null,null,null,{"$f":"N15","v":0},null,{"$f":"Simulação!I82","v":0},null,"Coleta total Sujeito passivo B"]
[null,{"$f":"IFERROR(D34/F34,0)","v":0},null,{"$f":"D34-D35*B38","v":0},null,{"$f":"IF(O29=0,0,IF(D38>1,D38/O29)*(O33-O34))","v":0},null,null,{"$f":"IFERROR(K34/M34,0)","v":0},null,{"$f":"K34-K35*I38","v":0},null,{"$f":"IF(O29=0,0,IF(K38>1,K38/O29)*(O33-O34))","v":0},null,{"$f":"Simulação!I83","v":0},null,"Deduções à coleta Sujeito passivo B"]
[null,{"$f":"IFERROR(D34/F34,0)","v":0},null,{"$f":"D34-D35*B39","v":0},null,{"$f":"IF(O30=0,0,IF(D39>1,D39/O30)*(O35-O36))","v":0},null,null,{"$f":"IFERROR(K34/M34,0)","v":0},null,{"$f":"K34-K35*I39","v":0},null,{"$f":"IF(O30=0,0,IF(K39>1,K39/O30)*(O35-O36))","v":0}]
[null,null,null,null,"SP A","SP B","SP A","SP B"]
[null,"Credito de imposto Cat. A →",null,null,{"$f":"IF(F29+F30<0,0,IF(F30>O33,O33-O34,IF(F30>F29,F29,IF(F29>F30,F30,0))))","v":0},{"$f":"IF(M29+M30<0,0,IF(M30>O33,O33-O34,IF(M30>M29,M29,IF(M29>M30,M30,0))))","v":0},{"$f":"IF(F29+F31<0,0,IF(F31>O35,O35-O36,IF(F31>F29,F29,IF(F29>F31,F31,0))))","v":0},{"$f":"IF(M29+M31<0,0,IF(M31>O37,O37-O38,IF(M31>M29,M29,IF(M29>M31,M31,0))))","v":0}]
[null,"Credito Imposto Cat. H →",null,null,{"$f":"IF(F37+F38<0,0,IF(F38>O33,O33-O34,IF(F38>F37,F37,IF(F37>F38,F38,0))))","v":0},{"$f":"IF(M37+M38<0,0,IF(M38>O33,O33-O34,IF(M38>M37,M37,IF(M37>M38,M38,0))))","v":0},{"$f":"IF(F37+F39<0,0,IF(F39>O35,O35-O36,IF(F39>F37,F37,IF(F37>F39,F39,0))))","v":0},{"$f":"IF(M37+M39<0,0,IF(M39>O37,O37-O38,IF(M39>M37,M37,IF(M37>M39,M39,0))))","v":0}]
[null,null,null,null,{"$f":"SUM(E41:E42)","v":0},{"$f":"SUM(F41:F42)","v":0},{"$f":"SUM(G41:G42)","v":0},{"$f":"SUM(H41:H42)","v":0}]
[null,null,null,"SOMA →",{"$f":"SUM(E43:F43)","v":0},null,{"$f":"SUM(G43)","v":0},{"$f":"SUM(H43)","v":0}]
[]
[]
[]
[]
[null,"FIM"]

{"sheet":"Deduções à Coleta","index":9,"n_rows":36,"n_cols":5,"rows_kept":36,"cut":false,"hidden":false,"merged":[]}
[]
[]
[]
[null,{"$f":"Simulação!I4","v":"Sujeito Passivo A+B Casados, opção pela tributação conjunta"},{"$f":"Simulação!J4","v":"Sujeito Passivo A Casado, opção pela tributação separada"},{"$f":"Simulação!K4","v":"Sujeito Passivo B Casado, opção pela tributação separada"}]
[null,{"$f":"'Anexo H'!B123","v":0},{"$f":"'Anexo H'!I121","v":0},{"$f":"'Anexo H'!I122","v":0},"◄Art.º 78.º - C do CIRS, Dedução das despesas de saúde + Prémios de Seguros de Saúde;"]
[null,{"$f":"'Anexo H'!B138","v":0},{"$f":"'Anexo H'!I136","v":0},{"$f":"'Anexo H'!I137","v":0},"◄Art.º 78.º - D do CIRS, Dedução das despesas de formação e educação;"]
[null,{"$f":"'Anexo H'!B151","v":0},{"$f":"'Anexo H'!I149","v":0},{"$f":"'Anexo H'!I150","v":0},"◄Art.º 78.º - E do CIRS, Dedução das rendas pagas para habitação própria e permanente;"]
[null,{"$f":"'Anexo H'!B164","v":0},{"$f":"'Anexo H'!I162","v":0},{"$f":"'Anexo H'!I163","v":0},"◄Art.º 78.º - E do CIRS, Dedução dos juros de dívida com a aquisição de habitação própria e permanente;"]
[null,{"$f":"'Anexo H'!B177","v":0},{"$f":"'Anexo H'!I175","v":0},{"$f":"'Anexo H'!I176","v":0},"◄Art.º 78.º - F do CIRS, Dedução do IVA suportado em fatura;"]
[null,{"$f":"'Anexo H'!B188","v":0},{"$f":"'Anexo H'!I186","v":0},{"$f":"'Anexo H'!I187","v":0},"◄Art.º 83.º - A do CIRS, Dedução das pensões de alimentos;"]
[null,{"$f":"'Anexo H'!B200","v":0},{"$f":"'Anexo H'!I198","v":0},{"$f":"'Anexo H'!I199","v":0},"◄Art.º 84.º do CIRS, Dedução das despesas com lares;"]
[null,{"$f":"'Anexo H'!B278","v":0},{"$f":"'Anexo H'!I276","v":0},{"$f":"'Anexo H'!I277","v":0},"◄Art.º 17.º  do EBF, Dedução dos valores aplicados em regime público da capitalização;"]
[null,{"$f":"'Anexo H'!B266","v":0},{"$f":"'Anexo H'!I264","v":0},{"$f":"'Anexo H'!I265","v":0},"◄Art.º 21.º  do EBF, Dedução dos PPR'S;"]
[null,{"$f":"'Anexo H'!B290","v":0},{"$f":"'Anexo H'!I288","v":0},{"$f":"'Anexo H'!I289","v":0},"◄Art.º 71.º  do EBF, Dedução dos encargos com reabilitação de imóveis;"]
[null,{"$f":"'Anexo H'!B308","v":0},{"$f":"'Anexo H'!I306","v":0},{"$f":"'Anexo H'!I307","v":0},"◄Donativos a particulares;"]
[null,{"$f":"'Anexo H'!B322","v":0},{"$f":"'Anexo H'!I320","v":0},{"$f":"'Anexo H'!I321","v":0},"◄Donativos ao Estado."]
[null,{"$f":"SUM(B5:B16)","v":0},{"$f":"SUM(C5:C16)","v":0},{"$f":"SUM(D5:D16)","v":0},"◄SOMA"]
[null,{"$f":"'Anexo H'!D341","v":"Sem limite"},{"$f":"'Anexo H'!G341","v":"Sem limite"},{"$f":"'Anexo H'!J341","v":"Sem limite"},"◄ A soma das deduções à coleta das alíneas c) a h) e k) do n.º 1 do art.º 78.º do CIRS não pode exceder estes limites"]
[]
[]
[null,{"$f":"'Anexo H'!D95+'Anexo H'!H95+'Anexo H'!L95+'Anexo H'!P95","v":0},{"$f":"IF('Modelo 3'!D38=0,0,B21/2)","v":0},{"$f":"IF('Modelo 3'!D38=0,0,B21/2)","v":0},"◄Art.º 78.º - A do CIRS, Dedução dos dependentes e afilhados civis com mais de 3 anos ;"]
[null,{"$f":"'Anexo H'!F95+'Anexo H'!J95+'Anexo H'!N95+'Anexo H'!R95","v":0},{"$f":"IF('Modelo 3'!D38=0,0,B22/2)","v":0},{"$f":"IF('Modelo 3'!D38=0,0,B22/2)","v":0},"◄Art.º 78.º - A do CIRS, Dedução dos dependentes e afilhados civis até 3 anos;"]
[null,{"$f":"'Anexo H'!T95","v":0},{"$f":"IF('Modelo 3'!D38=0,0,B23/2)","v":0},{"$f":"IF('Modelo 3'!D38=0,0,B23/2)","v":0},"◄Art.º 78.º - A do CIRS, Dedução dos ascendentes;"]
[null,{"$f":"'Anexo H'!B111","v":0},{"$f":"'Anexo H'!I109","v":0},{"$f":"'Anexo H'!I110","v":0},"◄Art.º 78.º - B do CIRS, Dedução das despesas gerais familiares;"]
[null,{"$f":"'Anexo H'!T204","v":0},{"$f":"'Anexo H'!T210","v":0},{"$f":"'Anexo H'!T216","v":0},"◄Art.º 87.º  do CIRS, Dedução dos sujeitos passivos, deficientes, com grau de invalidez ≥ 60% e < 90 %;"]
[null,{"$f":"'Anexo H'!T205","v":0},{"$f":"'Anexo H'!T211","v":0},{"$f":"'Anexo H'!T217","v":0},"◄Art.º 87.º  do CIRS, Dedução dos dependentes, afilhados civis, ascendentes, deficientes, com grau de invalidez ≥ 60% e < 90 %;"]
[null,{"$f":"'Anexo H'!T206","v":0},{"$f":"'Anexo H'!T212","v":0},{"$f":"'Anexo H'!T218","v":0},"◄Art.º 87.º  do CIRS, Deduão dos sujeito passivos, dependentes, afilhados civis, deficientes, com grau de invalidez ≥ 90%;"]
[null,{"$f":"'Anexo H'!T207","v":0},{"$f":"'Anexo H'!T213","v":0},{"$f":"'Anexo H'!T219","v":0},"◄Art.º 87.º  do CIRS, Dedução dos sujeitos passivos, dependentes, afilhados civis, deficientes  das Forças Armadas, com grau de invalidez ≥ 60% e < 90 %;"]
[null,{"$f":"'Anexo H'!T208","v":0},{"$f":"'Anexo H'!T214","v":0},{"$f":"'Anexo H'!T220","v":0},"◄Art.º 87.º  do CIRS, Dedução dos sujeitos passivos, dependentes, afilhados civis, deficientes das Forças Armadas, com grau de invalidez ≥ 90%;"]
[null,{"$f":"'Anexo H'!B230","v":0},{"$f":"'Anexo H'!I228","v":0},{"$f":"'Anexo H'!I229","v":0},"◄Art.º 87.º  do CIRS, Dedução das contribuições para reforma por velhice;"]
[null,{"$f":"'Anexo H'!B242","v":0},{"$f":"'Anexo H'!I240","v":0},{"$f":"'Anexo H'!I241","v":0},"◄Art.º 87.º  do CIRS, Dedução dos prémios de seguros de vida dos SP e dependentes deficientes;"]
[null,{"$f":"'Anexo H'!B253","v":0},{"$f":"'Anexo H'!I251","v":0},{"$f":"'Anexo H'!I252","v":0},"◄Art.º 87.º  do CIRS, Dedução das despesas de educação dos Suj. Pas. e dependentes deficientes;"]
[null,{"$f":"'Anexo H'!B90","v":0},{"$f":"'Anexo H'!I88","v":0},{"$f":"'Anexo H'!I89","v":0},"◄Art.º 78.º n.º 1 alínea l, do CIRS, + (Art.º 135.º-I do CIMI), Dedução do adicional ao imposto municipal sobre imóveis."]
[null,{"$f":"SUM(B21:B33)","v":0},{"$f":"SUM(C21:C33)","v":0},{"$f":"SUM(D21:D33)","v":0},"◄SOMA"]
[]
[null,{"$f":"'Anexo H'!D345","v":0},{"$f":"'Anexo H'!G345","v":0},{"$f":"'Anexo H'!J345","v":0},"◄SOMA TOTAL"]

{"sheet":"Artigos","index":10,"n_rows":107,"n_cols":15,"rows_kept":107,"cut":false,"hidden":false,"merged":[[93,1,93,2],[88,1,88,2],[89,1,89,2],[90,1,90,2],[91,1,91,2],[92,1,92,2],[0,20,1,22],[0,17,1,17],[3,17,4,18],[18,6,18,7],[18,8,18,9],[17,4,17,9],[11,17,12,18],[13,17,14,18],[15,17,16,18],[5,17,6,18],[7,17,8,18],[9,17,10,18],[18,4,18,5],[17,17,20,18],[18,1,18,3],[36,1,36,3],[21,17,22,18],[23,17,24,18],[33,7,33,8],[25,17,26,18],[28,1,28,2],[29,1,29,2],[30,1,30,2],[31,1,31,2],[28,17,29,18],[31,5,31,6],[32,5,32,6],[53,4,53,9],[54,6,54,7],[54,8,54,9],[54,4,54,5],[35,4,35,9],[36,6,36,7],[36,8,36,9],[36,4,36,5],[87,3,87,5],[84,1,84,2],[81,1,81,2],[77,1,77,2],[78,1,78,2],[79,1,79,2],[80,1,80,2],[46,1,46,2],[32,1,32,2],[87,7,87,9],[87,11,87,13],[76,6,76,8],[78,8,78,9],[79,8,79,9],[80,8,80,9],[78,5,78,6],[79,5,79,6],[80,5,80,6],[76,3,76,5],[76,1,76,2],[72,1,72,2],[65,1,65,2],[66,1,66,2],[73,1,73,2],[75,1,75,2],[51,7,51,8],[47,1,47,2],[48,1,48,2],[69,7,69,8],[67,1,67,2],[67,5,67,6],[68,1,68,2],[68,5,68,6],[49,5,49,6],[50,1,50,2],[50,5,50,6],[64,1,64,2],[49,1,49,2],[54,1,54,3]]}
[]
[]
[]
[null,"Modelo 3 - Taxa de Participação no IRS dos Municípios"]
[null,"Modelo 3 - Desvalorização da Moeda"]
[null,"Modelo 3 - Tabela da atividade do art.º 151.º do CIRS"]
[null,"Modelo 3 - Rendimentos da cat. E"]
[]
[null,"Art.º 68.º do CIRS - Taxas Gerais"]
[null,"Art.º 68.º - A do CIRS - Taxa adicional"]
[null,"Art.º 70.º do CIRS - Mínimo de Existência"]
[]
[]
[]
[]
[null,"INICIO"]
[]
[null,"Art.º 68.º do CIRS - Taxas Gerais",null,null,"Tributação conjunta",null,null,null,null,null,null,null,null,{"$f":"'Anexo A'!R46","v":1},{"$f":"IF(O19=TRUE,4,IF(O20=TRUE,1,IF(O21=TRUE,1,'Anexo A'!S46)))","v":1}]
[null,"Rendimento Colectável",null,null,"Continente ",null,"Açores",null,"Madeira",null,null,null,null,null,{"$f":"'Modelo 3'!D43","v":0}]
[null,"Escalões","Mais de","Até","T. normal","P. a abater","T. normal","P. a abater","T. normal","P. a abater",null,null,null,null,{"$f":"'Modelo 3'!E43","v":0}]
[null,"1º Escalão",0,7091,{"$f":"IF(F33<=D21,14.5%)","v":0.14499999999999999},0,{"$f":"IF(F33<=D21,10.15%)","v":0.10150000000000001},0,{"$f":"IF(F33<=D21,12.41%)","v":0.1241},0,null,null,null,null,{"$f":"'Modelo 3'!F43","v":0}]
[null,"2º Escalão",7091,10700,{"$f":"IF(F33<=D22,23%)","v":0.23},602.74,{"$f":"IF(F33<=D22,17.25%)","v":0.17249999999999999},503.46,{"$f":"IF(F33<=D22,23%)","v":0.23},750.94]
[null,"3º Escalão",10700,20261,{"$f":"IF(F33<=D23,28.5%)","v":0.28499999999999998},1191.23,{"$f":"IF(F33<=D23,21.38%)","v":0.21379999999999999},945.35,{"$f":"IF(F33<=D23,28.5%)","v":0.28499999999999998},1339.43]
[null,"4º Escalão",20261,25000,{"$f":"IF(F33<=D24,35%)","v":0.35},2508.11,{"$f":"IF(F33<=D24,28%)","v":0.28000000000000003},2286.66,{"$f":"IF(F33<=D24,35%)","v":0.35},2656.42]
[null,"5º Escalão",25000,36856,{"$f":"IF(F33<=D25,37%)","v":0.37},3008.25,{"$f":"IF(F33<=D25,29.6%)","v":0.29600000000000004},2686.75,{"$f":"IF(F33<=D25,37%)","v":0.37},3156.5]
[null,"6º Escalão",36856,80640,{"$f":"IF(F33<=D26,45%)","v":0.45},5956.67,{"$f":"IF(F33<=D26,36%)","v":0.36},5045.59,{"$f":"IF(F33<=D26,45%)","v":0.45},6104.83]
[null,"7º Escalão",">",80640,{"$f":"IF(F33>D27,48%)","v":false},8376.08,{"$f":"IF(F33>D27,38.4%)","v":false},6981,{"$f":"IF(F33>D27,48%)","v":false},8524.4500000000007]
[null,null,null,null,{"$f":"IF(O18=1,IF(F32<=G34,0%,MIN(E21:E27)))","v":0},{"$f":"IF(O18=1,IF(F32<=G34,0,IF(E21=14.5%,F21,IF(E22=23%,F22,IF(E23=28.5%,F23,IF(E24=35%,F24,IF(E25=37%,F25,IF(E26=45%,F26,IF(E27=48%,F27)))))))))","v":0},{"$f":"IF(O18=2,IF(F32<=G34,0%,MIN(G21:G27)))","v":false},{"$f":"IF(O18=2,IF(F32<=G34,0,IF(G21=10.15%,H21,IF(G22=17.25%,H22,IF(G23=21.38%,H23,IF(G24=28%,H24,IF(G25=29.6%,H25,IF(G26=36%,H26,IF(G27=38.4%,H27)))))))))","v":false},{"$f":"IF(O18=3,IF(F32<=G34,0%,MIN(I21:I27)))","v":false},{"$f":"IF(O18=3,IF(F32<=G34,0,IF(I21=12.41%,J21,IF(I22=23%,J22,IF(I23=28.5%,J23,IF(I24=35%,J24,IF(I25=37%,J25,IF(I26=45%,J26,IF(I27=48%,J27)))))))))","v":false}]
[null,"Continente ",null,{"$f":"IF(O18=1,F28+H28+J28,)","v":0},{"$f":"IF(O18=1,E28+G28+I28,)","v":0}]
[null,"Açores ",null,{"$f":"IF(O18=2,F28+H28+J28,)","v":0},{"$f":"IF(O18=2,E28+G28+I28,)","v":0}]
[null,"Madeira",null,{"$f":"IF(O18=3,F28+H28+J28,)","v":0},{"$f":"IF(O18=3,E28+G28+I28,)","v":0}]
[null,{"$f":"IF(E28+G28+I28<0,0,SUM(E29+E30+E31))","v":0},null,"← Taxa Normal",null,{"$f":"Simulação!G72","v":0},null,"← Rendimento Coletável "]
[null,{"$f":"IF(F28+H28+J28<0,0,SUM(D29+D30+D31))","v":0},null,"← Parcel a Abater ",null,{"$f":"Simulação!G74","v":0},null,"← Rendimento para o apuramento da taxa"]
[null,null,null,null,null,null,{"$f":"N34","v":0},"N.º de Filhos →",null,{"$f":"SUM('Modelo 3'!G16+'Modelo 3'!G17+'Modelo 3'!H16+'Modelo 3'!H17+'Modelo 3'!I16+'Modelo 3'!I17+'Modelo 3'!J16+'Modelo 3'!J17)","v":0},{"$f":"IF(J34>=5,0,IF(J34>=3,H85,))","v":0},{"$f":"IF(J34>=5,H86,)","v":0},{"$f":"SUM(K34+L34)","v":0},{"$f":"IF(N18=0,M34,IF(N18=1,M34*2))","v":0}]
[]
[null,"Art.º 68.º do CIRS - Taxas Gerais",null,null,"Tributação separada, Sujeito passivo A",null,null,null,null,null,null,null,null,null,{"$f":"IF(O37=TRUE,4,IF(O38=TRUE,1,IF(O39=TRUE,1,'Anexo A'!S46)))","v":1}]
[null,"Rendimento Colectável",null,null,"Continente ",null,"Açores",null,"Madeira",null,null,null,null,null,{"$f":"'Modelo 3'!D43","v":0}]
[null,"Escalões","Mais de","Até","T. normal","P. a abater","T. normal","P. a abater","T. normal","P. a abater",null,null,null,null,{"$f":"'Modelo 3'!E43","v":0}]
[null,"1º Escalão",{"$f":"C21","v":0},{"$f":"D21","v":7091},{"$f":"IF(F51<=D39,14.5%)","v":0.14499999999999999},0,{"$f":"IF(F51<=D39,10.15%)","v":0.10150000000000001},0,{"$f":"IF(F51<=D39,12.41%)","v":0.1241},0,null,null,null,null,{"$f":"'Modelo 3'!F43","v":0}]
[null,"2º Escalão",{"$f":"C22","v":7091},{"$f":"D22","v":10700},{"$f":"IF(F51<=D40,23%)","v":0.23},602.74,{"$f":"IF(F51<=D40,17.25%)","v":0.17249999999999999},503.46,{"$f":"IF(F51<=D40,23%)","v":0.23},750.94]
[null,"3º Escalão",{"$f":"C23","v":10700},20261,{"$f":"IF(F51<=D41,28.5%)","v":0.28499999999999998},1191.23,{"$f":"IF(F51<=D41,21.38%)","v":0.21379999999999999},945.35,{"$f":"IF(F51<=D41,28.5%)","v":0.28499999999999998},1339.43]
[null,"4º Escalão",20261,25000,{"$f":"IF(F51<=D42,35%)","v":0.35},2508.11,{"$f":"IF(F51<=D42,28%)","v":0.28000000000000003},2286.66,{"$f":"IF(F51<=D42,35%)","v":0.35},2656.42]
[null,"5º Escalão",25000,36856,{"$f":"IF(F51<=D43,37%)","v":0.37},3008.25,{"$f":"IF(F51<=D43,29.6%)","v":0.29600000000000004},2686.75,{"$f":"IF(F51<=D43,37%)","v":0.37},3156.5]
[null,"6º Escalão",36856,80640,{"$f":"IF(F51<=D44,45%)","v":0.45},5956.67,{"$f":"IF(F51<=D44,36%)","v":0.36},5045.59,{"$f":"IF(F51<=D44,45%)","v":0.45},6104.83]
[null,"7º Escalão",">",80640,{"$f":"IF(F51>D45,48%)","v":false},8376.08,{"$f":"IF(F51>D45,38.4%)","v":false},6981,{"$f":"IF(F51>D45,48%)","v":false},8524.4500000000007]
[null,null,null,null,{"$f":"IF(O36=1,IF(F50<=G52,0%,MIN(E39:E45)))","v":0},{"$f":"IF(O36=1,IF(F50<=G52,0,IF(E39=14.5%,F39,IF(E40=23%,F40,IF(E41=28.5%,F41,IF(E42=35%,F42,IF(E43=37%,F43,IF(E44=45%,F44,IF(E45=48%,F45)))))))))","v":0},{"$f":"IF(O36=2,IF(F50<=G52,0%,MIN(G39:G45)))","v":false},{"$f":"IF(O36=2,IF(F50<=G52,0,IF(G39=10.15%,H39,IF(G40=17.25%,H40,IF(G41=21.38%,H41,IF(G42=28%,H42,IF(G43=29.6%,H43,IF(G44=36%,H44,IF(G45=38.4%,H45)))))))))","v":false},{"$f":"IF(O36=3,IF(F50<=G52,0%,MIN(I39:I45)))","v":false},{"$f":"IF(O36=3,IF(F50<=G52,0,IF(I39=12.41%,J39,IF(I40=23%,J40,IF(I41=28.5%,J41,IF(I42=35%,J42,IF(I43=37%,J43,IF(I44=45%,J44,IF(I45=48%,J45)))))))))","v":false}]
[null,"Continente ",null,{"$f":"IF(O36=1,F46+H46+J46,)","v":0},{"$f":"IF(O36=1,E46+G46+I46,)","v":0}]
[null,"Açores ",null,{"$f":"IF(O36=2,F46+H46+J46,)","v":0},{"$f":"IF(O36=2,E46+G46+I46,)","v":0}]
[null,"Madeira",null,{"$f":"IF(O36=3,F46+H46+J46,)","v":0},{"$f":"IF(O36=3,E46+G46+I46,)","v":0}]
[null,{"$f":"IF(E46+G46+I46<0,0,SUM(E47+E48+E49))","v":0},null,"← Taxa Normal",null,{"$f":"Simulação!H72","v":0},null,"← Rendimento Coletável "]
[null,{"$f":"IF(F46+H46+J46<0,0,SUM(D47+D48+D49))","v":0},null,"← Parcel a Abater ",null,{"$f":"Simulação!H74","v":0},null,"← Rendimento para o apuramento da taxa"]
[null,null,null,null,null,null,{"$f":"M52","v":0},"N.º de Filhos →",null,{"$f":"SUM(J34)","v":0},{"$f":"IF(J52>=5,0,IF(J52>=3,H85,))","v":0},{"$f":"IF(J52>=5,H86,)","v":0},{"$f":"SUM(K52+L52)","v":0}]
[]
[null,"Art.º 68.º do CIRS - Taxas Gerais",null,null,"Tributação separada, Sujeito passivo B",null,null,null,null,null,null,null,null,null,{"$f":"IF(O55=TRUE,4,IF(O56=TRUE,1,IF(O57=TRUE,1,'Anexo A'!S46)))","v":1}]
[null,"Rendimento Colectável",null,null,"Continente ",null,"Açores",null,"Madeira",null,null,null,null,null,{"$f":"'Modelo 3'!D43","v":0}]
[null,"Escalões","Mais de","Até","T. normal","P. a abater","T. normal","P. a abater","T. normal","P. a abater",null,null,null,null,{"$f":"'Modelo 3'!E43","v":0}]
[null,"1º Escalão",{"$f":"C39","v":0},{"$f":"D39","v":7091},{"$f":"IF(F69<=D57,14.5%)","v":0.14499999999999999},0,{"$f":"IF(F69<=D57,10.15%)","v":0.10150000000000001},0,{"$f":"IF(F69<=D57,12.41%)","v":0.1241},0,null,null,null,null,{"$f":"'Modelo 3'!F43","v":0}]
[null,"2º Escalão",{"$f":"C40","v":7091},{"$f":"D40","v":10700},{"$f":"IF(F69<=D58,23%)","v":0.23},602.74,{"$f":"IF(F69<=D58,17.25%)","v":0.17249999999999999},503.46,{"$f":"IF(F69<=D58,23%)","v":0.23},750.94]
[null,"3º Escalão",{"$f":"C41","v":10700},20261,{"$f":"IF(F69<=D59,28.5%)","v":0.28499999999999998},1191.23,{"$f":"IF(F69<=D59,21.38%)","v":0.21379999999999999},945.35,{"$f":"IF(F69<=D59,28.5%)","v":0.28499999999999998},1339.43]
[null,"4º Escalão",{"$f":"C42","v":20261},25000,{"$f":"IF(F69<=D60,35%)","v":0.35},2508.11,{"$f":"IF(F69<=D60,28%)","v":0.28000000000000003},2286.66,{"$f":"IF(F69<=D60,35%)","v":0.35},2656.42]
[null,"5º Escalão",{"$f":"C43","v":25000},36856,{"$f":"IF(F69<=D61,37%)","v":0.37},3008.25,{"$f":"IF(F69<=D61,29.6%)","v":0.29600000000000004},2686.75,{"$f":"IF(F69<=D61,37%)","v":0.37},3156.5]
[null,"6º Escalão",{"$f":"C44","v":36856},80640,{"$f":"IF(F69<=D62,45%)","v":0.45},5956.67,{"$f":"IF(F69<=D62,36%)","v":0.36},5045.59,{"$f":"IF(F69<=D62,45%)","v":0.45},6104.83]
[null,"7º Escalão",{"$f":"C45","v":">"},80640,{"$f":"IF(F69>D63,48%)","v":false},8376.08,{"$f":"IF(F69>D63,38.4%)","v":false},6981,{"$f":"IF(F69>D63,48%)","v":false},8524.4500000000007]
[null,null,null,null,{"$f":"IF(O54=1,IF(F68<=G70,0%,MIN(E57:E63)))","v":0},{"$f":"IF(O54=1,IF(F68<=G70,0,IF(E57=14.5%,F57,IF(E58=23%,F58,IF(E59=28.5%,F59,IF(E60=35%,F60,IF(E61=37%,F61,IF(E62=45%,F62,IF(E63=48%,F63)))))))))","v":0},{"$f":"IF(O54=2,IF(F68<=G70,0%,MIN(G57:G63)))","v":false},{"$f":"IF(O54=2,IF(F68<=G70,0,IF(G57=10.15%,H57,IF(G58=17.25%,H58,IF(G59=21.38%,H59,IF(G60=28%,H60,IF(G61=29.6%,H61,IF(G62=36%,H62,IF(G63=38.4%,H63)))))))))","v":false},{"$f":"IF(O54=3,IF(F68<=G70,0%,MIN(I57:I63)))","v":false},{"$f":"IF(O54=3,IF(F68<=G70,0,IF(I57=12.41%,J57,IF(I58=23%,J58,IF(I59=28.5%,J59,IF(I60=35%,J60,IF(I61=37%,J61,IF(I62=45%,J62,IF(I63=48%,J63)))))))))","v":false}]
[null,"Continente ",null,{"$f":"IF(O54=1,F64+H64+J64,)","v":0},{"$f":"IF(O54=1,E64+G64+I64,)","v":0}]
[null,"Açores ",null,{"$f":"IF(O54=2,F64+H64+J64,)","v":0},{"$f":"IF(O54=2,E64+G64+I64,)","v":0}]
[null,"Madeira",null,{"$f":"IF(O54=3,F64+H64+J64,)","v":0},{"$f":"IF(O54=3,E64+G64+I64,)","v":0}]
[null,{"$f":"IF(E64+G64+I64<0,0,SUM(E65+E66+E67))","v":0},null,"← Taxa Normal",null,{"$f":"Simulação!I72","v":0},null,"← Rendimento Coletável "]
[null,{"$f":"IF(F64+H64+J64<0,0,SUM(D65+D66+D67))","v":0},null,"← Parcel a Abater ",null,{"$f":"Simulação!I74","v":0},null,"← Rendimento para o apuramento da taxa"]
[null,null,null,null,null,null,{"$f":"M70","v":0},"N.º de Filhos →",null,{"$f":"SUM(J34)","v":0},{"$f":"IF(J70>=5,0,IF(J70>=3,H85,))","v":0},{"$f":"IF(J70>=5,H86,)","v":0},{"$f":"SUM(K70+L70)","v":0}]
[]
[null,"Art.º 68.º - A do CIRS - Taxa adicional",null,null,null,null,null,null,null,null,null,null,null,{"$f":"'Anexo A'!R46","v":1},{"$f":"IF(O73=TRUE,4,IF(O74=TRUE,1,IF(O75=TRUE,1,'Anexo A'!S46)))","v":1}]
[null,"Taxas →",null,{"$f":"SUM(F73+H73)","v":0},{"$f":"SUM(G73+I73)","v":0},{"$f":"IF(O72=1,IF(D76>=D74,2.5%,IF(O72=1,IF(E76>=D74,2.5%,IF(O72=1,IF(F76>=D74,2.5%,))))))","v":0},{"$f":"IF(O72=1,IF(D76>=E74,5%,IF(O72=1,IF(E76>=E74,5%,IF(O72=1,IF(F76>=E74,5%,))))))","v":0},{"$f":"IF(O72=2,IF(D76>=D74,2%,IF(O72=2,IF(E76>=D74,2%,IF(O72=2,IF(F76>=D74,2%,))))))","v":false},{"$f":"IF(O72=2,IF(D76>=E74,4%,IF(O72=2,IF(E76>=E74,4%,IF(O72=2,IF(F76>=E74,4%,))))))","v":false},null,null,null,null,null,{"$f":"'Modelo 3'!D43","v":0}]
[null,"Limites →",null,80000,250000,{"$f":"E74-D74","v":170000},null,null,null,null,null,null,null,null,{"$f":"'Modelo 3'!E43","v":0}]
[null,null,null,"SP A+B","SP A","SP B",null,null,null,null,"SP A+B","SP A","SP B",null,{"$f":"'Modelo 3'!F43","v":0}]
[null,"R.Coletavel →",null,{"$f":"Simulação!I15","v":0},{"$f":"Simulação!J15","v":0},{"$f":"Simulação!K15","v":0},null,null,null,null,{"$f":"D78+G78","v":0},{"$f":"E78+H78","v":0},{"$f":"F78+I78","v":0}]
[null,null,null,2.5000000000000001E-2,null,null,0.05]
[null,"SOMA TOTAL →",null,{"$f":"IF(D76<D74,0,IF(D76<E74,(D76-D74)*D73,IF(D76>D74,(E74-D74)*D73)))","v":0},{"$f":"IF(E76<D74,0,IF(E76<E74,(E76-D74)*D73,IF(E76>D74,(E74-D74)*D73)))","v":0},{"$f":"IF(F76<D74,0,IF(F76<E74,(F76-D74)*D73,IF(F76>D74,(E74-D74)*D73)))","v":0},{"$f":"IF(D76>E74,(D76-E74)*E73,)","v":0},{"$f":"IF(E76>E74,(E76-E74)*E73,)","v":0},{"$f":"IF(F76>E74,(F76-E74)*E73,)","v":0}]
[null,"Continente ",null,"SOMA",{"$f":"IF(N72=0,K76,SUM(L76:M76))","v":0},{"$f":"IF(O72=1,E79,)","v":0},null,null,"T. Separado"]
[null,"Açores ",null,"SOMA",{"$f":"IF(E79<0,0,E79)","v":0},{"$f":"IF(O72=2,E80,)","v":0},null,"SP A→",{"$f":"IF(O72>=4,0,SUM(K80,))","v":0},null,{"$f":"IF(E76=0,0,IF(N72=0,0,SUM(L76,)))","v":0}]
[null,"Madeira",null,"SOMA",{"$f":"IF(E79<0,0,E79)","v":0},{"$f":"IF(O72=3,E81,)","v":0},null,"SP B→",{"$f":"IF(O72>=4,0,SUM(K81,))","v":0},null,{"$f":"IF(F76=0,0,IF(N72=0,0,SUM(M76,)))","v":0}]
[null,{"$f":"IF(E79<0,0,SUM(F79:G81))","v":0},null,"← Soma-se à Importância Apurada"]
[]
[null,"Art.º 70.º do CIRS - Mínimo de Existência",null,null,null,null,null,null,"Não são aplicadas as taxas estabelecidas no artigo 68.º: ↓"]
[null,"Limites →",null,{"$f":"E85*F85*G85","v":9006.9},14,{"$f":"'Modelo 3'!G36","v":428.9},1.5,{"$f":"IF(G86=2,11320/2,IF(G86=4,11320/2,IF(G86=6,11320/2,11320)))","v":5660},"← A quem tenha três ou quatro dependentes cujo montante seja igual ou inferior a  € 11 320; "]
[null,null,null,null,null,null,{"$f":"'Modelo 3'!C59","v":2},{"$f":"IF(G86=2,15560/2,IF(G86=4,15560/2,IF(G86=6,15560/2,15560)))","v":7780},"← A quem tenha cinco ou mais dependentes cujo montante seja igual ou inferior a € 15 560."]
[null,null,{"$f":"IF(E94>=D87,0,(Simulação!G66-Simulação!G83-F87-F90))","v":0}]
[null,null,null,"Sujeito Passivo A + B",null,null,null,"Sujeito Passivo A ",null,null,null,"Sujeito Passivo B",null,null,{"$f":"N72","v":1}]
[null,"Cat. A + cat. H + R.Verdes",null,{"$f":"IF(Simulação!G72=0,0,SUM('Anexo A'!O7+'Anexo A'!Q7+'Anexo A'!O22+'Anexo A'!O23+'Anexo A'!O24+'Anexo A'!O26+'Anexo A'!Q22+'Anexo A'!Q23+'Anexo A'!Q24+'Anexo A'!Q26+'Anexo B'!P16+'Anexo B'!R16+'Anexo J'!L7+'Anexo J'!N7+'Anexo J'!L13+'Anexo J'!N13)+E95)","v":0},{"$f":"I89+M89","v":18013.8},{"$f":"J89+N89","v":0},null,{"$f":"SUM('Anexo A'!O7+'Anexo A'!O22+'Anexo A'!O23+'Anexo A'!O24+'Anexo A'!O26+'Anexo B'!P16+'Anexo J'!L7+'Anexo J'!L13)+F95","v":0},{"$f":"D85","v":9006.9},{"$f":"IF(H94>=I89,H94-I89,IF(H94<I89,0,))","v":0},null,{"$f":"SUM('Anexo A'!Q7+'Anexo A'!Q22+'Anexo A'!Q23+'Anexo A'!Q24+'Anexo A'!Q26+'Anexo B'!R16+'Anexo J'!N7+'Anexo J'!N13)+F95","v":0},{"$f":"D85","v":9006.9},{"$f":"IF(L94>=M89,L94-M89,IF(L94<M89,0,))","v":0}]
[null,"Cat. B",null,{"$f":"SUM('Anexo B'!P10+'Anexo B'!P11+'Anexo B'!P12+'Anexo B'!P13+'Anexo B'!P14+'Anexo B'!P15+'Anexo B'!P17+'Anexo B'!P18+'Anexo B'!R10+'Anexo B'!R11+'Anexo B'!R12+'Anexo B'!R13+'Anexo B'!R14+'Anexo B'!R15+'Anexo B'!R17+'Anexo B'!R18+'Anexo B'!P20+'Anexo B'!P21+'Anexo B'!P22+'Anexo B'!P23+'Anexo B'!P24+'Anexo B'!P25+'Anexo B'!P26+'Anexo B'!P27+'Anexo B'!R20+'Anexo B'!R21+'Anexo B'!R22+'Anexo B'!R23+'Anexo B'!R24+'Anexo B'!R25+'Anexo B'!R26+'Anexo B'!R27)","v":0},null,{"$f":"(Simulação!G66-Simulação!G80)","v":0},null,{"$f":"SUM('Anexo B'!P10+'Anexo B'!P11+'Anexo B'!P12+'Anexo B'!P13+'Anexo B'!P14+'Anexo B'!P15+'Anexo B'!P17+'Anexo B'!P18+'Anexo B'!P20+'Anexo B'!P21+'Anexo B'!P22+'Anexo B'!P23+'Anexo B'!P24+'Anexo B'!P25+'Anexo B'!P26+'Anexo B'!P27)","v":0},null,{"$f":"Simulação!H66-Simulação!H80","v":0},null,{"$f":"SUM('Anexo B'!R10+'Anexo B'!R11+'Anexo B'!R12+'Anexo B'!R13+'Anexo B'!R14+'Anexo B'!R15+'Anexo B'!R17+'Anexo B'!R18+'Anexo B'!R20+'Anexo B'!R21+'Anexo B'!R22+'Anexo B'!R23+'Anexo B'!R24+'Anexo B'!R25+'Anexo B'!R26+'Anexo B'!R27)","v":0},null,{"$f":"Simulação!I66-Simulação!I80","v":0}]
[null,"Cat. E",null,{"$f":"SUM('Anexo E'!P8+'Anexo E'!R8+'Anexo E'!P18+'Anexo E'!R18)","v":0},null,{"$f":"IF(E94>=D89,0,(Simulação!G66-Simulação!G83-F89-F90))","v":0},null,{"$f":"SUM('Anexo E'!P8+'Anexo E'!P18)","v":0},null,{"$f":"IF(I94>=H89,0,(Simulação!H66-Simulação!H83-J89-J90))","v":0},null,{"$f":"SUM('Anexo E'!R8+'Anexo E'!R18)","v":0},null,{"$f":"IF(M94>=L89,0,(Simulação!I66-Simulação!I83-N89-N90))","v":0}]
[null,"Cat. F",null,{"$f":"SUM('Anexo F'!Q9+'Anexo F'!S9+'Anexo F'!Q10+'Anexo F'!S10)","v":0},null,null,null,{"$f":"SUM('Anexo F'!Q9+'Anexo F'!Q10)","v":0},null,null,null,{"$f":"SUM('Anexo F'!S9+'Anexo F'!S10)","v":0}]
[null,"Cat. G",null,{"$f":"SUM('Anexo G'!B65+'Anexo G'!B89)","v":0},null,null,null,{"$f":"SUM('Anexo G'!I63+'Anexo G'!I87)","v":0},null,null,null,{"$f":"SUM('Anexo G'!I64+'Anexo G'!I88)","v":0}]
[null,"SOMA →",null,{"$f":"IF(D90+D91+D92+D93>D89,0,SUM(D89:D93))","v":0},{"$f":"SUM(D90:D93)","v":0},{"$f":"IF(O72>=4,0,IF(F91<=0,0,SUM(F91)))","v":0},null,{"$f":"IF(H90+H91+H92+H93>H89,0,SUM(H89:H93))","v":0},{"$f":"SUM(H90:H93)","v":0},{"$f":"IF(O72>=4,0,IF(J91<=0,0,SUM(J91)))","v":0},null,{"$f":"IF(L90+L91+L92+L93>L89,0,SUM(L89:L93))","v":0},{"$f":"SUM(L90:L93)","v":0},{"$f":"IF(O72>=4,0,IF(N91<=0,0,SUM(N91)))","v":0}]
[null,"Rendimento dos dependentes",null,null,{"$f":"SUM('Anexo A'!S7+'Anexo A'!U7+'Anexo A'!W7+'Anexo A'!Y7+'Anexo A'!S22+'Anexo A'!S23+'Anexo A'!S24+'Anexo A'!S26+'Anexo A'!U22+'Anexo A'!U23+'Anexo A'!U24+'Anexo A'!U26+'Anexo A'!W22+'Anexo A'!W23+'Anexo A'!W24+'Anexo A'!W26+'Anexo A'!Y22+'Anexo A'!Y23+'Anexo A'!Y24+'Anexo B'!T16+'Anexo B'!V16)","v":0},{"$f":"IF(O88=1,E95/2,E95)","v":0}]
[]
[]
[null,{"$f":"E85*F85*G85","v":9006.9},"Mínimo de existência"]
[null,{"$f":"'Modelo 3'!E36*E85","v":8120},"O valor do mínimo de existência não pode ser inferior a este"]
[null,"Cálculo é:","Rendimento Bruto - Valor apurado",null,null,{"$f":"Simulação!I8-Simulação!I21","v":0},"- limite artigo 70º ",null,{"$f":"IF(E94>=D89,0,(Simulação!I8-Simulação!I24)-F89-F90)","v":0},{"$f":"J94","v":0},{"$f":"N94","v":0},{"$f":"J100+K100","v":0}]
[null,null,"Rendimento ilíquido - limite artigo 70º - beneficio municipal= coleta liquida"]
[]
[]
[]
[]
[]
[null,"FIM"]

{"sheet":"Simulação","index":11,"n_rows":104,"n_cols":24,"rows_kept":104,"cut":false,"hidden":false,"merged":[[2,8,2,10],[63,12,63,14],[63,9,63,11],[63,15,63,17],[14,5,14,7],[15,1,16,6],[63,21,63,23],[98,1,99,1],[31,8,31,9],[0,17,1,18],[3,8,5,8],[87,1,88,5],[62,1,62,6],[66,1,67,5],[78,1,79,5],[84,1,85,5],[3,9,5,9],[3,10,5,10],[5,1,5,7],[29,6,29,7],[63,18,63,20],[30,7,30,8]]}
[]
[]
[null,null,null,null,null,null,null,null,{"$f":"IF('Modelo 3'!D38>=1,\"Opção pela entrega em Separado\",IF('Modelo 3'!K38>=1,\"Opção pela entrega em conjunto\",\" \"))","v":"Opção pela entrega em Separado"}]
[null,{"$f":"B44","v":"Residência: Continente "},null,null,null,null,null,null,{"$f":"TEXT(B46,)","v":"Sujeito Passivo A+B Casados, opção pela tributação conjunta"},{"$f":"TEXT(B47,)","v":"Sujeito Passivo A Casado, opção pela tributação separada"},{"$f":"TEXT(B48,)","v":"Sujeito Passivo B Casado, opção pela tributação separada"}]
[]
[null,"Descrição"]
[null,null,null,null,null,null,null,null,"Valores ","Valores ","Valores "]
[null,"01 - Rendimento global",null,null,null,null,null,null,{"$f":"G66","v":0},{"$f":"H66","v":0},{"$f":"I66","v":0}]
[null,"02 - Deduções específicas",null,null,null,null,null,null,{"$f":"G68","v":0},{"$f":"H68","v":0},{"$f":"I68","v":0}]
[null,"03 - Perdas a recuperar",null,null,null,null,null,null,{"$f":"G69","v":0},{"$f":"H69","v":0},{"$f":"I69","v":0}]
[null,"04 - Abatimentos",null,null,null,null,null,null,0,0,0]
[null,"05 - Quociente dos rendimentos de anos anteriores",null,null,null,null,null,null,{"$f":"G71","v":0},0,0]
[null,"06 - Rendimento coletável",null,null,null,null,null,null,0,0,0]
[null,"07 - Coeficiente conjugal",null,null,null,null,{"$f":"TEXT(A484,)","v":""},null,0,0,0]
[null,"08 - Rendimento coletável corrigido               ",null,null,null,"  Valor para o apuramento da TAXA ➤",null,null,0,0,0]
[null,{"$f":"TEXT(B45,)","v":"09 - Taxa de IRS  para o Continente"},null,null,null,null,null,"Escalões ➤",{"$f":"TEXT(B49,)","v":""},{"$f":"TEXT(B51,)","v":""},{"$f":"TEXT(B53,)","v":""}]
[null,null,null,null,null,null,null,null,{"$f":"G75","v":0},0,0]
[null,"10 - Importância apurada",null,null,null,null,null,null,0,0,0]
[null,"11 - Parcela a abater",null,null,null,null,null,null,0,0,0]
[null,"12 - Imposto de rendimentos de anos anteriores",null,null,null,null,null,null,0,0,0]
[null,"13 - Valor apurado  ",null,null,null,null,null,null,{"$f":"G80","v":0},0,0]
[null,"14 - Imposto relativo a tributações autónomas ",null,null,null,null,null,null,{"$f":"G81","v":0},{"$f":"H81","v":0},0]
[null,"15 - Coleta total",null,null,null,null,null,null,0,0,0]
[null,"16 - Deduções à coleta  ",null,null,null,null,null,null,{"$f":"G83","v":0},{"$f":"H83","v":0},0]
[null,"17 - Crédito de imposto",null,null,null,null,null,null,{"$f":"G84","v":0},0,0]
[null,"18 - Benefício Municipal ",null,null,null,null,null,null,{"$f":"G87","v":0},0,0]
[null,"19 - Coleta líquida ",null,null,null,null,null,null,{"$f":"G89","v":0},{"$f":"H89","v":0},0]
[null,"20 - Pagamentos por conta",null,null,null,null,null,null,0,0,0]
[null,"21 - Retenções na fonte ",null,null,null,null,null,null,0,0,0]
[null,"22 - Imposto apurado (SP A+B Tributação Conjunta)",null,null,null,null,{"$f":"B95","v":"NÃO RECEBE, NEM PAGA  ➤"},null,{"$f":"G93","v":0}]
[null,"23 - Imposto apurado (SP A Tributação Separada)",null,null,null,null,null,{"$f":"B96","v":"NÃO RECEBE, NEM PAGA  ➤"},null,{"$f":"H93","v":0}]
[null,"24 - Imposto apurado (SP B Tributação Separada)",null,null,null,null,null,null,{"$f":"B97","v":"NÃO RECEBE, NEM PAGA  ➤"},null,{"$f":"I93","v":0}]
[]
[null,null,null,null,null,null,null,null,{"$f":"TEXT(B57,)","v":""},{"$f":"TEXT(B58,)","v":""},{"$f":"TEXT(B59,)","v":""}]
[null,{"$f":"TEXT(B56,)","v":""},null,{"$f":"TEXT(B55,)","v":""},null,null,null,null,{"$f":"H56","v":""},{"$f":"I56","v":""},{"$f":"J56","v":""}]
[]
[]
[]
[]
[]
[null,"INICIO"]
[]
[null,{"$f":"'Modelo 3'!F52","v":1},{"$f":"'Modelo 3'!C58","v":2}]
[null,{"$f":"IF(B43<>\"\",IF(B43=1,\"Residência: Continente \",IF(B43=2,\"Residência: Região Autónoma dos Açores\",IF(B43=3,\"Residência: Região Autónoma da Madeira\",IF(B43=4,\"Residência: País da comunidade europeia\",IF(B43=5,\"Residência: País fora da comunidade europeia\",))))))","v":"Residência: Continente "}]
[null,{"$f":"IF(B43=1,\"09 - Taxa de IRS  para o Continente\",IF(B43=2,\"09 - Taxa de IRS  para a R. A. dos Açores\",IF(B43=3,\"09 - Taxa de IRS  para a R. A. da Madeira\",IF(B43>=4,\"09 - Taxa de IRS\",))))","v":"09 - Taxa de IRS  para o Continente"}]
[null,{"$f":"IF(C43=1,\"Sujeito Passivo A+B Casados, opção pela tributação conjunta\",IF(C43=2,\"Sujeito Passivo A+B Casados, opção pela tributação conjunta\",IF(C43=3,\"Sujeito Passivo A+B Unidos de Facto, opção pela tributação conjunta\",IF(C43=4,\"Sujeito Passivo A+B Unidos de Facto, opção pela  tributação conjunta\",IF(C43=5,\"Sujeito Passivo A+B Viúvo(a), opção pela tributação conjunta\",IF(C43=6,\"Sujeito Passivo A+B Viúvo(a), opção pela tributação conjunta\",IF(C43=7,\"Sujeito Passivo A Viúvo(a)\",IF(C43=8,\"Sujeito Passivo A Solteiro(a)\",IF(C43=9,\"Sujeito Passivo A Divorciado(a)\",IF(C43=10,\"Sujeito Passivo A Separado(a) Judicialmente\",IF(C43=11,\"Sujeito Passivo A Separado(a) de Facto\",)))))))))))","v":"Sujeito Passivo A+B Casados, opção pela tributação conjunta"}]
[null,{"$f":"IF(C43=2,\"Sujeito Passivo A Casado, opção pela tributação separada\",IF(C43=4,\"Sujeito Passivo A Unido de Facto, opção pela tributação separada\",IF(C43=6,\"Sujeito Passivo A Viúvo(a), opção pela tributação separada\",)))","v":"Sujeito Passivo A Casado, opção pela tributação separada"}]
[null,{"$f":"IF(C43=2,\"Sujeito Passivo B Casado, opção pela tributação separada\",IF(C43=4,\"Sujeito Passivo B Unido de Facto, opção pela tributação separada\",IF(C43=6,\"Sujeito Passivo B Falecido(a), opção pela tributação separada\",)))","v":"Sujeito Passivo B Casado, opção pela tributação separada"}]
[null,{"$f":"IF(B50=1,\"1º Escalão\",IF(B50=2,\"2º Escalão\",IF(B50=3,\"3º Escalão\",IF(B50=4,\"4º Escalão\",IF(B50=5,\"5º Escalão\",IF(B50=6,\"6º Escalão\",IF(B50=7,\"7º Escalão\",)))))))","v":0},null,null,null,null,null,{"$f":"Artigos!E28","v":0},{"$f":"Artigos!G28","v":false},{"$f":"Artigos!I28","v":false}]
[null,{"$f":"IF(H49=14.5%,1,IF(H49=23%,2,IF(H49=28.5%,3,IF(H49=35%,4,IF(H49=37%,5,IF(H49=45%,6,IF(H49=48%,7,IF(I49=10.15%,1,IF(I49=17.25%,2,IF(I49=21.38%,3,IF(I49=28%,4,IF(I49=29.6%,5,IF(I49=36%,6,IF(I49=38.4%,7,IF(J49=12.41%,1,IF(J49=23%,2,IF(J49=28.5%,3,IF(J49=35%,4,IF(J49=37%,5,IF(J49=45%,6,IF(J49=48%,7,)))))))))))))))))))))","v":0},null,null,null,null,null,{"$f":"Artigos!E46","v":0},{"$f":"Artigos!G46","v":false},{"$f":"Artigos!I46","v":false}]
[null,{"$f":"IF(B52=1,\"1º Escalão\",IF(B52=2,\"2º Escalão\",IF(B52=3,\"3º Escalão\",IF(B52=4,\"4º Escalão\",IF(B52=5,\"5º Escalão\",IF(B52=6,\"6º Escalão\",IF(B52=7,\"7º Escalão\",)))))))","v":0},null,null,null,null,null,{"$f":"Artigos!E64","v":0},{"$f":"Artigos!G64","v":false},{"$f":"Artigos!I64","v":false}]
[null,{"$f":"IF(H50=14.5%,1,IF(H50=23%,2,IF(H50=28.5%,3,IF(H50=35%,4,IF(H50=37%,5,IF(H50=45%,6,IF(H50=48%,7,IF(H50=10.15%,1,IF(I50=17.25%,2,IF(I50=21.38%,3,IF(I50=28%,4,IF(I50=29.6%,5,IF(I50=36%,6,IF(I50=38.4%,7,IF(J50=12.41%,1,IF(J50=23%,2,IF(J50=28.5%,3,IF(J50=35%,4,IF(J50=37%,5,IF(J50=45%,6,IF(J50=48%,7,)))))))))))))))))))))","v":0}]
[null,{"$f":"IF(B54=1,\"1º Escalão\",IF(B54=2,\"2º Escalão\",IF(B54=3,\"3º Escalão\",IF(B54=4,\"4º Escalão\",IF(B54=5,\"5º Escalão\",IF(B54=6,\"6º Escalão\",IF(B54=7,\"7º Escalão\",)))))))","v":0}]
[null,{"$f":"IF(H51=14.5%,1,IF(H51=23%,2,IF(H51=28.5%,3,IF(H51=35%,4,IF(H51=37%,5,IF(H51=45%,6,IF(H51=48%,7,IF(I51=10.15%,1,IF(I51=17.25%,2,IF(I51=21.38%,3,IF(I51=28%,4,IF(I51=29.6%,5,IF(I51=36%,6,IF(I51=38.4%,7,IF(J51=12.41%,1,IF(J51=23%,2,IF(J51=28.5%,3,IF(J51=35%,4,IF(J51=37%,5,IF(J51=45%,6,IF(J51=48%,7,)))))))))))))))))))))","v":0}]
[null,{"$f":"IF(Artigos!F94+Artigos!J94+Artigos!N94>=1,\" Mínimo de existência a aplicar prevista no art.º 70.º do CIRS  ➤\",)","v":0},null,null,null,null,null,{"$f":"G86","v":0},{"$f":"H86","v":0},{"$f":"I86","v":0}]
[null,{"$f":"IF(Artigos!F94+Artigos!J94+Artigos!N94>=1,\"AJUSTES À COLETA: \",)","v":0},null,null,null,null,null,{"$f":"IF(H55=0,\"\",H55)","v":""},{"$f":"IF(I55=0,\"\",I55)","v":""},{"$f":"IF(J55=0,\"\",J55)","v":""}]
[null,{"$f":"IF(H55>=1,\"S. Passiva A+B ▼\",)","v":0}]
[null,{"$f":"IF(I55>=1,\"S. Passiva A ▼\",)","v":0}]
[null,{"$f":"IF(J55>=1,\"S. Passiva B ▼\",)","v":0}]
[]
[]
[null,"DEMONSTRAÇÃO DETALHADA DO CÁLCULO"]
[null,"Sujeito passivo A + B",null,null,null,null,null,"S. Passivo A","S. Passivo B",{"$f":"IF('Anexo A'!R46=1,3,)","v":3},{"$f":"'Modelo 3'!D38","v":1}]
[null,"Quociente Conjugal →",null,null,{"$f":"'Modelo 3'!C59","v":2},{"$f":"IF(G66>1,E64,)","v":0},"Q. Conjugal →",1,"← Q. Conjugal ","SOMA Anexo A",null,null,"SOMA Anexo B",null,null,"SOMA Anexo E",null,null,"SOMA Anexo F",null,null,"SOMA Anexo G"]
[null,"Descrição",null,null,null,null,"Valores","Valores","Valores","SP A+B Conjunta","SP A Separado","SP B Separado","SP A+B Conjunta","SP A Separado","SP B Separado","SP A+B Conjunta","SP A Separado","SP B Separado","SP A+B Conjunta","SP A Separado","SP B Separado","SP A+B Conjunta","SP A Separado","SP B Separado"]
[null,"01 - Rendimento global",null,null,null,null,{"$f":"J66+M66+P66+S66+V66","v":0},{"$f":"K66+N66+Q66+T66+W66","v":0},{"$f":"L66+O66+R66+U66+X66","v":0},{"$f":"'Anexo A'!B55+'Anexo A'!B178+'Anexo A'!B188+'Anexo A'!B198","v":0},{"$f":"IF(J63=3,'Anexo A'!K53+'Anexo A'!J176+'Anexo A'!J186+'Anexo A'!J196,)","v":0},{"$f":"IF(J63=3,'Anexo A'!K54+'Anexo A'!J177+'Anexo A'!J187+'Anexo A'!J197,)","v":0},{"$f":"'Anexo B'!B126+'Anexo B'!B146+'Anexo B'!B182","v":0},{"$f":"IF(J63=3,'Anexo B'!I124+'Anexo B'!I144+'Anexo B'!I180,)","v":0},{"$f":"IF(J63=3,'Anexo B'!I125+'Anexo B'!I145+'Anexo B'!I181,)","v":0},{"$f":"'Anexo E'!B51","v":0},{"$f":"IF(J63=3,'Anexo E'!I49,)","v":0},{"$f":"IF(J63=3,'Anexo E'!I50,)","v":0},{"$f":"'Anexo F'!B47","v":0},{"$f":"IF(J63=3,'Anexo F'!I45,)","v":0},{"$f":"IF(J63=3,'Anexo F'!I46,)","v":0},{"$f":"'Anexo G'!B65+'Anexo G'!B89+'Anexo G'!B77","v":0},{"$f":"IF(J63=3,'Anexo G'!I63+'Anexo G'!I87+'Anexo G'!I75,)","v":0},{"$f":"IF(J63=3,'Anexo G'!I64+'Anexo G'!I88+'Anexo G'!I76,)","v":0}]
[null,"02 - Deduções específicas",null,null,null,null,{"$f":"J67+M67+S67","v":0},{"$f":"K67+N67+T67","v":0},{"$f":"L67+O67+U67","v":0},{"$f":"'Anexo A'!B70+'Anexo A'!B81+'Anexo A'!B93+'Anexo A'!B103+'Anexo A'!B114+'Anexo A'!B125+'Anexo A'!B220+'Anexo A'!B232","v":0},{"$f":"IF(J63=3,'Anexo A'!K68+'Anexo A'!K79+'Anexo A'!K91+'Anexo A'!K101+'Anexo A'!K112+'Anexo A'!K123+'Anexo A'!J218+'Anexo A'!J230,)","v":0},{"$f":"IF(J63=3,'Anexo A'!K69+'Anexo A'!K80+'Anexo A'!K92+'Anexo A'!K102+'Anexo A'!K113+'Anexo A'!K124+'Anexo A'!J219+'Anexo A'!J231,)","v":0},{"$f":"'Anexo B'!B162","v":0},{"$f":"IF(J63=3,'Anexo B'!I160,)","v":0},{"$f":"IF(J63=3,'Anexo B'!I161,)","v":0},null,null,null,{"$f":"'Anexo F'!B70","v":0},{"$f":"IF(J63=3,'Anexo F'!I68,)","v":0},{"$f":"IF(J63=3,'Anexo F'!I69,)","v":0}]
[null,null,null,null,null,null,{"$f":"IF(G67>=G66,G66,IF(G67<G66,G67,0))","v":0},{"$f":"IF(H67>=H66,H66,IF(H67<H66,H67,0))","v":0},{"$f":"IF(I67>=I66,I66,IF(I67<I66,I67,0))","v":0}]
[null,"03 - Perdas a recuperar (Prejuízos)",null,null,null,null,{"$f":"M69+P69+S69+V69","v":0},{"$f":"N69+Q69+T69+W69","v":0},{"$f":"O69+R69+U69+X69","v":0},null,null,null,{"$f":"'Anexo B'!B192","v":0},{"$f":"IF(J63=3,'Anexo B'!I190,)","v":0},{"$f":"IF(J63=3,'Anexo B'!I191,)","v":0},{"$f":"'Anexo E'!B71","v":0},{"$f":"IF(J63=3,'Anexo E'!I69,)","v":0},{"$f":"IF(J63=3,'Anexo E'!I70,)","v":0},{"$f":"'Anexo F'!B80","v":0},{"$f":"IF(J63=3,'Anexo F'!I78,)","v":0},{"$f":"IF(J63=3,'Anexo F'!I79,)","v":0},{"$f":"'Anexo G'!B112","v":0},{"$f":"IF(J63=3,'Anexo G'!I110,)","v":0},{"$f":"IF(J63=3,'Anexo G'!I111,)","v":0}]
[null,"04 - Abatimentos",null,null,null,null,0,0,0]
[null,"05 - Quociente rendimentos de anos anteriores",null,null,null,null,{"$f":"J71+M71+P71+S71+V71","v":0},{"$f":"K71+N71+Q71+T71+W71","v":0},{"$f":"L71+O71+R71+U71+X71","v":0},{"$f":"'Anexo A'!B166+'Anexo A'!B261","v":0},{"$f":"IF(J63=3,'Anexo A'!N164+'Anexo A'!N259,)","v":0},{"$f":"IF(J63=3,'Anexo A'!Q164+'Anexo A'!Q259,)","v":0},{"$f":"'Anexo B'!B223","v":0},{"$f":"IF(J63=3,'Anexo B'!N221,)","v":0},{"$f":"IF(J63=3,'Anexo B'!Q221,)","v":0},{"$f":"'Anexo E'!B92","v":0},{"$f":"IF(J63=3,'Anexo E'!N90,)","v":0},{"$f":"IF(J63=3,'Anexo E'!Q90,)","v":0},{"$f":"'Anexo F'!B101","v":0},{"$f":"IF(J63=3,'Anexo F'!N99,)","v":0},{"$f":"IF(J63=3,'Anexo F'!Q99,)","v":0},{"$f":"'Anexo G'!B123","v":0},{"$f":"IF(J63=3,'Anexo G'!N121,)","v":0},{"$f":"IF(J63=3,'Anexo G'!Q121,)","v":0}]
[null,"06 - Rendimento coletável",null,null,null,null,{"$f":"G66-G68-G69-G70-G71","v":0},{"$f":"H66-H68-H69-H70-H71","v":0},{"$f":"I66-I68-I69-I70-I71","v":0}]
[null,"07 - Coeficiente conjugal ",null,null,null,null,{"$f":"IFERROR(G72/E64,0)","v":0},{"$f":"IFERROR(H72/H64,0)","v":0},{"$f":"IFERROR(I72/H64,0)","v":0}]
[null,"08 - Rendimento coletável corrigido (Ap. Taxa)",null,null,null,null,{"$f":"G73","v":0},{"$f":"H73","v":0},{"$f":"I73","v":0}]
[null,"09 - Taxa de IRS  para o Continente                    ",null,null,null,null,{"$f":"Artigos!B32","v":0},{"$f":"Artigos!B50","v":0},{"$f":"Artigos!B68","v":0}]
[null,"10 - Importância apurada",null,null,null,null,{"$f":"(G75*G74)+Artigos!D78+Artigos!G78","v":0},{"$f":"(H75*H74)+Artigos!I80","v":0},{"$f":"(I75*I74)+Artigos!I81","v":0}]
[null,"11 - Parcela a abater",null,null,null,null,{"$f":"Artigos!B33","v":0},{"$f":"Artigos!B51","v":0},{"$f":"Artigos!B69","v":0}]
[null,"12 - Imposto de rendimentos de anos anteriores",null,null,null,null,{"$f":"J78+M78+P78+S78+V78","v":0},{"$f":"K78+N78+Q78+T78+W78","v":0},{"$f":"L78","v":0},{"$f":"'Anexo A'!B167+'Anexo A'!B262","v":0},{"$f":"IF(J63=3,'Anexo A'!N165+'Anexo A'!N260,)","v":0},{"$f":"IF(J63=3,'Anexo A'!Q165+'Anexo A'!Q260,)","v":0},{"$f":"'Anexo B'!B224","v":0},{"$f":"IF(J63=3,'Anexo B'!N222,)","v":0},{"$f":"IF(J63=3,'Anexo B'!Q222,)","v":0},{"$f":"'Anexo E'!B93","v":0},{"$f":"IF(J63=3,'Anexo E'!N91,)","v":0},{"$f":"IF(J63=3,'Anexo E'!Q91,)","v":0},{"$f":"'Anexo F'!B102","v":0},{"$f":"IF(J63=3,'Anexo F'!N100,)","v":0},{"$f":"IF(J63=3,'Anexo F'!Q100,)","v":0},{"$f":"'Anexo G'!B124","v":0},{"$f":"IF(J63=3,'Anexo G'!N122,)","v":0},{"$f":"IF(J63=3,'Anexo G'!Q122,)","v":0}]
[null,"13 -  Valor apurado  ×     ",null,null,null,null,{"$f":"IF(G76=0,0,(G76-G77)*E64+G78)","v":0},{"$f":"IF(H76=0,0,(H76-H77)*H64+H78)","v":0},{"$f":"IF(I76=0,0,(I76-I77)*H64+I78)","v":0}]
[null,null,null,null,null,null,{"$f":"IF(G68>=G66,0,SUM(G79))","v":0},{"$f":"IF(H68>=H66,0,SUM(H79))","v":0},{"$f":"IF(I68>=I66,0,SUM(I79))","v":0}]
[null,"14 - Imposto relativo a tributações autónomas ",null,null,null,null,{"$f":"J81+M81+P81+S81+V81","v":0},{"$f":"K81+N81+Q81+T81+W81","v":0},{"$f":"L81+O81+R81+U81+X81","v":0},{"$f":"'Anexo A'!B137+'Anexo A'!N135+'Anexo A'!N136+'Anexo A'!B209+'Anexo A'!M207+'Anexo A'!M208","v":0},{"$f":"IF(J63=3,'Anexo A'!K135+'Anexo A'!N135+'Anexo A'!J207+'Anexo A'!M207,)","v":0},{"$f":"IF(J63=3,'Anexo A'!K136+'Anexo A'!N136+'Anexo A'!J208+'Anexo A'!M208,)","v":0},{"$f":"'Anexo B'!Q160+'Anexo B'!Q161","v":0},{"$f":"IF(J63=3,'Anexo B'!Q160,)","v":0},{"$f":"IF(J63=3,'Anexo B'!Q161,)","v":0},{"$f":"'Anexo E'!B61+'Anexo E'!L59+'Anexo E'!L60","v":0},{"$f":"IF(J63=3,'Anexo E'!I59+'Anexo E'!L59,)","v":0},{"$f":"IF(J63=3,'Anexo E'!I60+'Anexo E'!L60,)","v":0},{"$f":"'Anexo F'!B60+'Anexo F'!L58+'Anexo F'!L59","v":0},{"$f":"IF(J63=3,'Anexo F'!I58+'Anexo F'!L58,)","v":0},{"$f":"IF(J63=3,'Anexo F'!I59+'Anexo F'!L59,)","v":0},{"$f":"'Anexo G'!B100+'Anexo G'!L98+'Anexo G'!L99","v":0},{"$f":"IF(J63=3,'Anexo G'!I98+'Anexo G'!L98,)","v":0},{"$f":"IF(J63=3,'Anexo G'!I99+'Anexo G'!L99,)","v":0}]
[null,"15 - Coleta total",null,null,null,null,{"$f":"G80+G81","v":0},{"$f":"H80+H81","v":0},{"$f":"I80+I81","v":0}]
[null,"16 - Deduções à coleta  ",null,null,null,null,{"$f":"'Deduções à Coleta'!B36","v":0},{"$f":"'Deduções à Coleta'!C36","v":0},{"$f":"'Deduções à Coleta'!D36","v":0}]
[null,"17 - Crédito de imposto",null,null,null,null,{"$f":"'Anexo J'!E44","v":0},{"$f":"'Anexo J'!G44","v":0},{"$f":"'Anexo J'!H44","v":0}]
[null,"18 - Correções à coleta (art.º 70.º)",null,null,null,null,{"$f":"IF('Modelo 3'!F52>=4,0,G82-G83-G84-G81-'Anexo H'!B330)","v":0},{"$f":"IF(H66=0,0,IF('Modelo 3'!F52>=4,0,H82-H83-H84-H81-'Anexo H'!B331))","v":0},{"$f":"IF(I66=0,0,IF('Modelo 3'!F52>=4,0,I82-I83-I84-I81-'Anexo H'!B332))","v":0}]
[null,null,null,null,null,null,{"$f":"Artigos!F94","v":0},{"$f":"Artigos!J94","v":0},{"$f":"Artigos!N94","v":0}]
[null,"19 - Benefício Municipal ",null,null,null,null,{"$f":"IF(G89=0,0,'Anexo H'!B330)","v":0},{"$f":"IF(H89=0,0,'Anexo H'!B331)","v":0},{"$f":"IF(I89=0,0,'Anexo H'!B332)","v":0}]
[null,"20 - Coleta líquida ",null,null,null,null,{"$f":"IF(G82-G83<G81,G81,(G82-G83-G84-G86))","v":0},{"$f":"IF(H82-H83<H81,H81,(H82-H83-H84-H86))","v":0},{"$f":"IF(I82-I83<I81,I81,(I82-I83-I84-I86))","v":0}]
[null,null,null,null,null,null,{"$f":"IF(G88<0,0,G88)-'Anexo H'!R56+'Anexo H'!R54+'Anexo H'!T54","v":0},{"$f":"IF(H88<0,0,H88)-'Anexo H'!R56+'Anexo H'!R54","v":0},{"$f":"IF(I88<0,0,I88)-'Anexo H'!R56+'Anexo H'!T54","v":0}]
[null,"21 - Pagamentos por conta",null,null,null,null,{"$f":"M90","v":0},{"$f":"N90","v":0},{"$f":"O90","v":0},null,null,null,{"$f":"'Anexo B'!B212+'Anexo B'!L210+'Anexo B'!L211","v":0},{"$f":"IF(J63=3,'Anexo B'!I210+'Anexo B'!L210,)","v":0},{"$f":"IF(J63=3,'Anexo B'!I211+'Anexo B'!L211,)","v":0}]
[null,"22 - Retenções na fonte ",null,null,null,null,{"$f":"J91+M91+P91+S91","v":0},{"$f":"K91+N91+Q91+T91","v":0},{"$f":"L91+O91+R91+U91","v":0},{"$f":"'Anexo A'!B147+'Anexo A'!B242","v":0},{"$f":"IF(J63=3,'Anexo A'!K145+'Anexo A'!N145+'Anexo A'!J240+'Anexo A'!N240,)","v":0},{"$f":"IF(J63=3,'Anexo A'!K146+'Anexo A'!N146+'Anexo A'!J241+'Anexo A'!N241,)","v":0},{"$f":"'Anexo B'!B202","v":0},{"$f":"IF(J63=3,'Anexo B'!I200+'Anexo B'!L200,)","v":0},{"$f":"IF(J63=3,'Anexo B'!I201+'Anexo B'!L201,)","v":0},{"$f":"'Anexo E'!B81","v":0},{"$f":"IF(J63=3,'Anexo E'!I79+'Anexo E'!L79,)","v":0},{"$f":"IF(J63=3,'Anexo E'!I80+'Anexo E'!L80,)","v":0},{"$f":"'Anexo F'!B90","v":0},{"$f":"IF(J63=3,'Anexo F'!I88+'Anexo F'!L88,)","v":0},{"$f":"IF(J63=3,'Anexo F'!I89+'Anexo F'!L89,)","v":0}]
[null,"23 - Imposto apurado                   ",null,null,null,null,{"$f":"(G89-G90-G91)-G87","v":0},{"$f":"(H89-H90-H91)-H87","v":0},{"$f":"(I89-I90-I91)-I87","v":0}]
[null,null,null,null,null,null,{"$f":"ABS(SUM(G92))","v":0},{"$f":"ABS(SUM(H92))","v":0},{"$f":"ABS(SUM(I92))","v":0}]
[]
[null,{"$f":"IF(G66<>1,IF(G92>G100,\"VALOR A PAGAR  ➤\",IF(G92<-G99,\"VALOR A RECEBER  ➤\",IF(G92<=G100,\"NÃO RECEBE, NEM PAGA  ➤\"))))","v":"NÃO RECEBE, NEM PAGA  ➤"}]
[null,{"$f":"IF(H66<>1,IF(H92>G100,\"VALOR A PAGAR  ➤\",IF(H92<-G99,\"VALOR A RECEBER  ➤\",IF(H92<=G100,\"NÃO RECEBE, NEM PAGA  ➤\"))))","v":"NÃO RECEBE, NEM PAGA  ➤"}]
[null,{"$f":"IF(I66<>1,IF(I92>G100,\"VALOR A PAGAR  ➤\",IF(I92<-G99,\"VALOR A RECEBER  ➤\",IF(I92<=G100,\"NÃO RECEBE, NEM PAGA  ➤\",))))","v":"NÃO RECEBE, NEM PAGA  ➤"}]
[]
[null,"Art.º 95.º\n do CIRS","LIMITE DE REEMBOLSO DE IRS <",null,null,null,9.99]
[null,null,"LIMITE DE COBRANÇA DE IRS >",null,null,null,24.99]
[]
[]
[]
[null,"FIM"]

{"sheet":"Folha para Imprimir","index":12,"n_rows":30,"n_cols":16,"rows_kept":30,"cut":false,"hidden":false,"merged":[[0,1,0,14],[22,13,22,14],[29,13,29,14],[23,13,23,14],[24,13,24,14],[25,13,25,14],[26,13,26,14],[27,13,27,14],[28,13,28,14],[28,8,28,10],[29,10,29,12],[27,6,27,8],[25,9,25,10],[26,11,26,12],[27,11,27,12],[28,11,28,12],[27,9,27,10],[26,9,26,10],[25,11,25,12],[23,11,23,12],[24,11,24,12],[23,9,23,10],[24,9,24,10],[17,13,17,14],[18,13,18,14],[17,9,17,10],[10,9,10,10],[12,13,12,14],[13,13,13,14],[10,11,10,12],[15,11,15,12],[12,11,12,12],[15,9,15,10],[16,11,16,12],[17,11,17,12],[18,11,18,12],[16,9,16,10],[21,13,21,14],[6,11,6,12],[11,13,11,14],[11,11,11,12],[6,13,6,14],[7,13,7,14],[14,13,14,14],[15,13,15,14],[16,13,16,14],[20,11,20,12],[19,11,19,12],[19,13,19,14],[20,13,20,14],[8,13,8,14],[9,13,9,14],[10,13,10,14],[13,5,13,8],[11,9,11,10],[12,9,12,10],[13,9,13,10],[14,9,14,10],[6,9,6,10],[7,9,7,10],[8,9,8,10],[21,11,21,12],[22,11,22,12],[9,9,9,10],[7,11,7,12],[8,11,8,12],[9,11,9,12],[13,11,13,12],[14,11,14,12],[19,9,19,10],[20,9,20,10],[21,9,21,10],[22,9,22,10],[18,9,18,10],[5,13,5,14],[2,11,4,12],[2,13,4,14],[4,1,5,8],[2,9,4,10],[5,9,5,10],[5,11,5,12]]}
[null,"Demonstração detalhada do cálculo do IRS, exercício de 2018, para imprimir",null,null,null,null,null,null,null,null,null,null,null,null,null,"Se pretender imprimir a demonstração, clique em ficheiro no canto superior esquerdo do computador > Imprimir página 1 de 1."]
[null,null,null,null,null,null,null,null,null,null,null,null,null,null,null,"Nota: Quando forem a imprimir têm que mudar na impressora para folha na horizontal."]
[null,{"$f":"Simulação!B4","v":"Residência: Continente "},null,null,null,null,null,null,null,{"$f":"Simulação!I4","v":"Sujeito Passivo A+B Casados, opção pela tributação conjunta"},null,{"$f":"Simulação!J4","v":"Sujeito Passivo A Casado, opção pela tributação separada"},null,{"$f":"Simulação!K4","v":"Sujeito Passivo B Casado, opção pela tributação separada"}]
[]
[null,{"$f":"Simulação!B6","v":"Descrição"}]
[null,null,null,null,null,null,null,null,null,{"$f":"Simulação!I7","v":"Valores "},null,{"$f":"Simulação!J7","v":"Valores "},null,{"$f":"Simulação!K7","v":"Valores "}]
[null,{"$f":"Simulação!B8","v":"01 - Rendimento global"},null,null,null,null,null,null,null,{"$f":"Simulação!I8","v":0},null,{"$f":"Simulação!J8","v":0},null,{"$f":"Simulação!K8","v":0}]
[null,{"$f":"Simulação!B9","v":"02 - Deduções específicas"},null,null,null,null,null,null,null,{"$f":"Simulação!I9","v":0},null,{"$f":"Simulação!J9","v":0},null,{"$f":"Simulação!K9","v":0}]
[null,{"$f":"Simulação!B10","v":"03 - Perdas a recuperar"},null,null,null,null,null,null,null,{"$f":"Simulação!I10","v":0},null,{"$f":"Simulação!J10","v":0},null,{"$f":"Simulação!K10","v":0}]
[null,{"$f":"Simulação!B11","v":"04 - Abatimentos"},null,null,null,null,null,null,null,{"$f":"Simulação!I11","v":0},null,{"$f":"Simulação!J11","v":0},null,{"$f":"Simulação!K11","v":0}]
[null,{"$f":"Simulação!B12","v":"05 - Quociente dos rendimentos de anos anteriores"},null,null,null,null,null,null,null,{"$f":"Simulação!I12","v":0},null,{"$f":"Simulação!J12","v":0},null,{"$f":"Simulação!K12","v":0}]
[null,{"$f":"Simulação!B13","v":"06 - Rendimento coletável"},null,null,null,null,null,null,null,{"$f":"Simulação!I13","v":0},null,{"$f":"Simulação!J13","v":0},null,{"$f":"Simulação!K13","v":0}]
[null,{"$f":"Simulação!B14","v":"07 - Coeficiente conjugal"},null,null,null,null,null,null,null,{"$f":"Simulação!I14","v":0},null,{"$f":"Simulação!J14","v":0},null,{"$f":"Simulação!K14","v":0}]
[null,{"$f":"Simulação!B15","v":"08 - Rendimento coletável corrigido               "},null,null,null,{"$f":"Simulação!F15","v":"  Valor para o apuramento da TAXA ➤"},null,null,null,{"$f":"Simulação!I15","v":0},null,{"$f":"Simulação!J15","v":0},null,{"$f":"Simulação!K15","v":0}]
[null,{"$f":"Simulação!B16","v":"09 - Taxa de IRS  para o Continente"},null,null,null,null,null,null,null,{"$f":"Simulação!I17","v":0},null,{"$f":"Simulação!J17","v":0},null,{"$f":"Simulação!K17","v":0}]
[null,{"$f":"Simulação!B18","v":"10 - Importância apurada"},null,null,null,null,null,null,null,{"$f":"Simulação!I18","v":0},null,{"$f":"Simulação!J18","v":0},null,{"$f":"Simulação!K18","v":0}]
[null,{"$f":"Simulação!B19","v":"11 - Parcela a abater"},null,null,null,null,null,null,null,{"$f":"Simulação!I19","v":0},null,{"$f":"Simulação!J19","v":0},null,{"$f":"Simulação!K19","v":0}]
[null,{"$f":"Simulação!B20","v":"12 - Imposto de rendimentos de anos anteriores"},null,null,null,null,null,null,null,{"$f":"Simulação!I20","v":0},null,{"$f":"Simulação!J20","v":0},null,{"$f":"Simulação!K20","v":0}]
[null,{"$f":"Simulação!B21","v":"13 - Valor apurado  "},null,null,null,null,null,null,null,{"$f":"Simulação!I21","v":0},null,{"$f":"Simulação!J21","v":0},null,{"$f":"Simulação!K21","v":0}]
[null,{"$f":"Simulação!B22","v":"14 - Imposto relativo a tributações autónomas "},null,null,null,null,null,null,null,{"$f":"Simulação!I22","v":0},null,{"$f":"Simulação!J22","v":0},null,{"$f":"Simulação!K22","v":0}]
[null,{"$f":"Simulação!B23","v":"15 - Coleta total"},null,null,null,null,null,null,null,{"$f":"Simulação!I23","v":0},null,{"$f":"Simulação!J23","v":0},null,{"$f":"Simulação!K23","v":0}]
[null,{"$f":"Simulação!B24","v":"16 - Deduções à coleta  "},null,null,null,null,null,null,null,{"$f":"Simulação!I24","v":0},null,{"$f":"Simulação!J24","v":0},null,{"$f":"Simulação!K24","v":0}]
[null,{"$f":"Simulação!B25","v":"17 - Crédito de imposto"},null,null,null,null,null,null,null,{"$f":"Simulação!I25","v":0},null,{"$f":"Simulação!J25","v":0},null,{"$f":"Simulação!K25","v":0}]
[null,{"$f":"Simulação!B26","v":"18 - Benefício Municipal "},null,null,null,null,null,null,null,{"$f":"Simulação!I26","v":0},null,{"$f":"Simulação!J26","v":0},null,{"$f":"Simulação!K26","v":0}]
[null,{"$f":"Simulação!B27","v":"19 - Coleta líquida "},null,null,null,null,null,null,null,{"$f":"Simulação!I27","v":0},null,{"$f":"Simulação!J27","v":0},null,{"$f":"Simulação!K27","v":0}]
[null,{"$f":"Simulação!B28","v":"20 - Pagamentos por conta"},null,null,null,null,null,null,null,{"$f":"Simulação!I28","v":0},null,{"$f":"Simulação!J28","v":0},null,{"$f":"Simulação!K28","v":0}]
[null,{"$f":"Simulação!B29","v":"21 - Retenções na fonte "},null,null,null,null,null,null,null,{"$f":"Simulação!I29","v":0},null,{"$f":"Simulação!J29","v":0},null,{"$f":"Simulação!K29","v":0}]
[null,"22 - Imposto apurado (SP A+B Tributação Conjunta)",null,null,null,null,{"$f":"Simulação!G30","v":"NÃO RECEBE, NEM PAGA  ➤"},{"$f":"Simulação!G30","v":"NÃO RECEBE, NEM PAGA  ➤"},null,{"$f":"Simulação!I30","v":0}]
[null,{"$f":"Simulação!B31","v":"23 - Imposto apurado (SP A Tributação Separada)"},null,null,null,null,null,null,{"$f":"Simulação!H31","v":"NÃO RECEBE, NEM PAGA  ➤"},null,null,{"$f":"Simulação!J31","v":0}]
[null,{"$f":"Simulação!B32","v":"24 - Imposto apurado (SP B Tributação Separada)"},null,null,null,null,null,null,null,null,{"$f":"Simulação!I32","v":"NÃO RECEBE, NEM PAGA  ➤"},null,null,{"$f":"Simulação!K32","v":0}]